How does teamcity handle Maven with multiple modules?

I have two simple spring projects, employee and SpringOne, both built fine on teamcity. Then I added a parent pom.xml:

<project xmlns="http://maven.apache.org/POM/4.0.0" xmlns:xsi="http://www.w3.org/2001/XMLSchema-instance"
         xsi:schemaLocation="http://maven.apache.org/POM/4.0.0 http://maven.apache.org/maven-v4_0_0.xsd">
    <modelVersion>4.0.0</modelVersion>
    <groupId>com.su</groupId>
    <artifactId>MainProject</artifactId>
    <version>1.0-SNAPSHOT</version>
    <packaging>pom</packaging>

    <modules>
 <module>employee</module>
 <module>SpringOne</module>
    </modules>
 
<distributionManagement>
        <snapshotRepository>
            <id>my-snapshots</id>
            <name>My internal repository</name>
            <url>http://jackbiglaptop:8081/nexus/content/repositories/snapshots</url>
        </snapshotRepository>
        <repository>
            <id>my-releases</id>
            <name>My internal repository</name>
            <url>http://jackbiglaptop:8081/nexus/content/repositories/releases</url>
        </repository>
    </distributionManagement>
</project>


<project xmlns="http://maven.apache.org/POM/4.0.0" xmlns:xsi="http://www.w3.org/2001/XMLSchema-instance"          xsi:schemaLocation="http://maven.apache.org/POM/4.0.0 http://maven.apache.org/maven-v4_0_0.xsd">     <modelVersion>4.0.0</modelVersion>      <parent>           <artifactId>MainProject</artifactId>           <groupId>com.su</groupId>           <version>1.0-SNAPSHOT</version>      </parent>     <groupId>com.su</groupId>     <artifactId>employee</artifactId>     <packaging>jar</packaging>     <version>1.0-SNAPSHOT</version>     <name>SpringOne</name>     <url>http://maven.apache.org</url>     <properties>         <spring.version>3.0.5.RELEASE</spring.version>         <postgresql.version>9.1-901.jdbc4</postgresql.version>     </properties>     <dependencies>         <dependency>             <groupId>junit</groupId>             <artifactId>junit</artifactId>             <version>3.8.1</version>             <scope>test</scope>         </dependency>         <dependency>             <groupId>org.springframework</groupId>             <artifactId>spring-core</artifactId>             <version>${spring.version}</version>         </dependency>         <dependency>             <groupId>org.springframework</groupId>             <artifactId>spring-context</artifactId>             <version>${spring.version}</version>         </dependency>         <dependency>             <groupId>postgresql</groupId>             <artifactId>postgresql</artifactId>             <version>${postgresql.version}</version>         </dependency>         <dependency>             <groupId>org.springframework</groupId>             <artifactId>spring-jdbc</artifactId>             <version>${spring.version}</version>         </dependency>     </dependencies>     <distributionManagement>         <snapshotRepository>             <id>my-snapshots</id>             <name>My internal repository</name>             <url>http://jackbiglaptop:8081/nexus/content/repositories/snapshots</url>         </snapshotRepository>         <repository>             <id>my-releases</id>             <name>My internal repository</name>             <url>http://jackbiglaptop:8081/nexus/content/repositories/releases</url>         </repository>     </distributionManagement> </project>




<project xmlns="http://maven.apache.org/POM/4.0.0" xmlns:xsi="http://www.w3.org/2001/XMLSchema-instance"          xsi:schemaLocation="http://maven.apache.org/POM/4.0.0 http://maven.apache.org/maven-v4_0_0.xsd">     <modelVersion>4.0.0</modelVersion>     <groupId>com.su</groupId>     <artifactId>SpringOne</artifactId>     <packaging>jar</packaging>     <version>1.0-SNAPSHOT</version>     <name>SpringOne</name>     <url>http://maven.apache.org</url>      <parent>           <artifactId>MainProject</artifactId>           <groupId>com.su</groupId>           <version>1.0-SNAPSHOT</version>      </parent>     <properties>         <spring.version>3.0.5.RELEASE</spring.version>         <postgresql.version>9.1-901.jdbc4</postgresql.version>     </properties>     <dependencies>         <dependency>             <groupId>junit</groupId>             <artifactId>junit</artifactId>             <version>3.8.1</version>             <scope>test</scope>         </dependency>         <dependency>             <groupId>org.springframework</groupId>             <artifactId>spring-core</artifactId>             <version>${spring.version}</version>         </dependency>         <dependency>             <groupId>org.springframework</groupId>             <artifactId>spring-context</artifactId>             <version>${spring.version}</version>         </dependency>         <dependency>             <groupId>postgresql</groupId>             <artifactId>postgresql</artifactId>             <version>${postgresql.version}</version>         </dependency>         <dependency>             <groupId>org.springframework</groupId>             <artifactId>spring-jdbc</artifactId>             <version>${spring.version}</version>         </dependency>     </dependencies> <distributionManagement>         <snapshotRepository>             <id>my-snapshots</id>             <name>My internal repository</name>             <url>http://jackbiglaptop:8081/nexus/content/repositories/snapshots</url>         </snapshotRepository>         <repository>             <id>my-releases</id>             <name>My internal repository</name>             <url>http://jackbiglaptop:8081/nexus/content/repositories/releases</url>         </repository>     </distributionManagement> </project>




When I ran teamcity build, I am seeing the following error.

Please advise. thanks.

[09:53:11]Publishing internal artifacts
[09:53:11]Clearing temporary directory: C:\TeamCity\buildAgent\temp\buildTmp
[09:53:11]Checkout directory: C:\TeamCity\buildAgent\work\473a7ed72e7b745e
[09:53:11]Updating sources: server side checkout
[09:53:11]Step 1/1: Maven (6s)
[09:53:11][Step 1/1] Using watcher: C:\TeamCity\buildAgent\plugins\mavenPlugin\maven-watcher\maven-watcher-agent.jar
[09:53:11][Step 1/1] Initial M2_HOME = c:\users\su\maven
[09:53:11][Step 1/1] Current M2_HOME = c:\users\su\maven
[09:53:11][Step 1/1] PATH = c:\users\su\maven\bin;C:\Program Files\CollabNet\Subversion Client;C:\app\oracle\product\12.1.0\dbhome_1\bin;%MAVEN_HOME%\bin;c:\program files\java\jdk1.7.0_45\bin;C:\Program Files (x86)\Intel\iCLS Client\;C:\Program Files\Intel\iCLS Client\;C:\WINDOWS\system32;C:\WINDOWS;C:\WINDOWS\System32\Wbem;C:\WINDOWS\System32\WindowsPowerShell\v1.0\;C:\Program Files (x86)\Intel\OpenCL SDK\2.0\bin\x86;C:\Program Files (x86)\Intel\OpenCL SDK\2.0\bin\x64;C:\Program Files\Intel\Intel(R) Management Engine Components\DAL;C:\Program Files\Intel\Intel(R) Management Engine Components\IPT;C:\Program Files (x86)\Intel\Intel(R) Management Engine Components\DAL;C:\Program Files (x86)\Intel\Intel(R) Management Engine Components\IPT;C:\Program Files\Lenovo\Bluetooth Software\;C:\Program Files\Lenovo\Bluetooth Software\syswow64;C:\Program Files (x86)\VisualSVN Server\bin;
[09:53:11][Step 1/1] Initial MAVEN_OPTS not set
[09:53:11][Step 1/1] Current MAVEN_OPTS not set
[09:53:11][Step 1/1] Starting: "C:\Program Files\Java\jdk1.7.0_45\bin\java.exe" -Dagent.home.dir=C:\TeamCity\buildAgent -Dagent.name=JackBigLaptop -Dagent.ownPort=9090 -Dagent.work.dir=C:\TeamCity\buildAgent\work -Dbuild.number=6 -Dbuild.vcs.number=5 -Dbuild.vcs.number.1=5 -Dbuild.vcs.number.MainProject_MainProject=5 -Dclassworlds.conf=C:\TeamCity\buildAgent\temp\buildTmp\teamcity.m2.conf -Dcom.jetbrains.maven.watcher.report.file=C:\TeamCity\buildAgent\temp\buildTmp\maven-build-info.xml -Djava.io.tmpdir=C:\TeamCity\buildAgent\temp\buildTmp -Dmaven.failsafe.debug='-javaagent:C:\TeamCity\buildAgent\plugins\coveragePlugin\coverage-agent.jar=C:\TeamCity\buildAgent\temp\buildTmp\coverage4048126807686829421args' -Dmaven.home=c:\users\su\maven -Dmaven.repo.local=C:/.m2/repository -Dmaven.surefire.debug='-javaagent:C:\TeamCity\buildAgent\plugins\coveragePlugin\coverage-agent.jar=C:\TeamCity\buildAgent\temp\buildTmp\coverage4048126807686829421args' -Dteamcity.agent.cpuBenchmark=540 -Dteamcity.agent.dotnet.agent_url=http://localhost:9090/RPC2 -Dteamcity.agent.dotnet.build_id=18 -Dteamcity.auth.password=d7lfdBOB5rdSN8R2s6zGy6TVM5tjurTp -Dteamcity.auth.userId=TeamCityBuildId=18 -Dteamcity.build.changedFiles.file=C:\TeamCity\buildAgent\temp\buildTmp\changedFiles7271889642607539483.txt -Dteamcity.build.checkoutDir=C:\TeamCity\buildAgent\work\473a7ed72e7b745e -Dteamcity.build.id=18 -Dteamcity.build.properties.file=C:\TeamCity\buildAgent\temp\buildTmp\teamcity.build1110773657545620537.properties -Dteamcity.build.tempDir=C:\TeamCity\buildAgent\temp\buildTmp -Dteamcity.build.workingDir=C:\TeamCity\buildAgent\work\473a7ed72e7b745e -Dteamcity.buildConfName=MainProject -Dteamcity.buildType.id=MainProject_MainProject -Dteamcity.configuration.properties.file=C:\TeamCity\buildAgent\temp\buildTmp\teamcity.config5756304132928804850.properties -Dteamcity.coverage.idea.baseDir=C:\TeamCity\buildAgent\temp\buildTmp\idea6838037627955084418coverage -Dteamcity.coverage.idea.excludePatterns=**/*Test.java -Dteamcity.coverage.idea.includePatterns=**/main/src/**/*.java -Dteamcity.coverage.runner=IDEA -Dteamcity.dotnet.nunitaddin=C:\TeamCity\buildAgent\plugins\dotnetPlugin\bin\JetBrains.TeamCity.NUnitAddin-NUnit -Dteamcity.dotnet.nunitlauncher=C:\TeamCity\buildAgent\plugins\dotnetPlugin\bin\JetBrains.BuildServer.NUnitLauncher.exe -Dteamcity.dotnet.nunitlauncher.msbuild.task=C:\TeamCity\buildAgent\plugins\dotnetPlugin\bin\JetBrains.BuildServer.MSBuildLoggers.dll -Dteamcity.dotnet.nunitlauncher1.1=C:\TeamCity\buildAgent\plugins\dotnetPlugin\bin\JetBrains.BuildServer.NUnitLauncher1.1.exe -Dteamcity.dotnet.nunitlauncher2.0=C:\TeamCity\buildAgent\plugins\dotnetPlugin\bin\JetBrains.BuildServer.NUnitLauncher2.0.exe -Dteamcity.dotnet.nunitlauncher2.0.vsts=C:\TeamCity\buildAgent\plugins\dotnetPlugin\bin\JetBrains.BuildServer.NUnitLauncher2.0.VSTS.exe -Dteamcity.dotnet.platform=C:\TeamCity\buildAgent\plugins\dotnetPlugin\bin\JetBrains.TeamCity.PlatformProcessRunner.1.1.exe -Dteamcity.maven.watcher.home=C:\TeamCity\buildAgent\plugins\mavenPlugin\maven-watcher -Dteamcity.projectName=MainProject -Dteamcity.runner.properties.file=C:\TeamCity\buildAgent\temp\buildTmp\teamcity.runner624609232819970536.properties -Dteamcity.tests.recentlyFailedTests.file=C:\TeamCity\buildAgent\temp\buildTmp\testsToRunFirst3186172005812643486.txt "-Dteamcity.version=8.0.5 (build 27692)" -classpath c:\users\su\maven\boot\plexus-classworlds-2.5.1.jar; org.codehaus.plexus.classworlds.launcher.Launcher -f C:\TeamCity\buildAgent\work\473a7ed72e7b745e\pom.xml -B deploy -X -e
[09:53:11][Step 1/1] in directory: C:\TeamCity\buildAgent\work\473a7ed72e7b745e
[09:53:11][Step 1/1] Apache Maven 3.1.1 (0728685237757ffbf44136acec0402957f723d9a; 2013-09-17 11:22:22-0400)
[09:53:11][Step 1/1] Maven home: c:\users\su\maven
[09:53:11][Step 1/1] Java version: 1.7.0_45, vendor: Oracle Corporation
[09:53:11][Step 1/1] Java home: C:\Program Files\Java\jdk1.7.0_45\jre
[09:53:11][Step 1/1] Default locale: en_US, platform encoding: Cp1252
[09:53:11][Step 1/1] OS name: "windows 8", version: "6.2", arch: "amd64", family: "windows"
[09:53:13][Step 1/1] [main] INFO org.apache.maven.cli.MavenCli - Error stacktraces are turned on.
[09:53:13][Step 1/1] [main] DEBUG org.apache.maven.cli.MavenCli - Reading global settings from c:\users\su\maven\conf\settings.xml
[09:53:13][Step 1/1] [main] DEBUG org.apache.maven.cli.MavenCli - Reading user settings from C:\.m2\settings.xml
[09:53:13][Step 1/1] [main] DEBUG org.apache.maven.DefaultMaven - Using local repository at C:\.m2\repository
[09:53:13][Step 1/1] [main] DEBUG org.eclipse.aether.internal.impl.DefaultLocalRepositoryProvider - Using manager EnhancedLocalRepositoryManager with priority 10.0 for C:\.m2\repository
[09:53:13][Step 1/1] [main] INFO org.apache.maven.cli.event.ExecutionEventLogger - Scanning for projects...
[09:53:13][Step 1/1] [main] DEBUG org.apache.maven.project.DefaultProjectBuildingHelper - Extension realms for project com.su:MainProject:pom:1.0-SNAPSHOT: (none)
[09:53:13][Step 1/1] [main] DEBUG org.apache.maven.lifecycle.internal.DefaultLifecyclePluginAnalyzer - Looking up lifecyle mappings for packaging pom from ClassRealm[plexus.core, parent: null]
[09:53:13][Step 1/1] [main] DEBUG org.apache.maven.project.DefaultProjectBuildingHelper - Extension realms for project com.su:employee:jar:1.0-SNAPSHOT: (none)
[09:53:13][Step 1/1] [main] DEBUG org.apache.maven.lifecycle.internal.DefaultLifecyclePluginAnalyzer - Looking up lifecyle mappings for packaging jar from ClassRealm[plexus.core, parent: null]
[09:53:13][Step 1/1] [main] DEBUG org.apache.maven.project.DefaultProjectBuildingHelper - Extension realms for project com.su:SpringOne:jar:1.0-SNAPSHOT: (none)
[09:53:13][Step 1/1] [main] DEBUG org.apache.maven.lifecycle.internal.DefaultLifecyclePluginAnalyzer - Looking up lifecyle mappings for packaging jar from ClassRealm[plexus.core, parent: null]
[09:53:13][Step 1/1] [main] INFO org.apache.maven.cli.event.ExecutionEventLogger - ------------------------------------------------------------------------
[09:53:13][Step 1/1] [main] INFO org.apache.maven.cli.event.ExecutionEventLogger - Reactor Build Order:
[09:53:13][Step 1/1] [main] INFO org.apache.maven.cli.event.ExecutionEventLogger -
[09:53:13][Step 1/1] [main] INFO org.apache.maven.cli.event.ExecutionEventLogger - MainProject
[09:53:13][Step 1/1] [main] INFO org.apache.maven.cli.event.ExecutionEventLogger - SpringOne
[09:53:13][Step 1/1] [main] INFO org.apache.maven.cli.event.ExecutionEventLogger - SpringOne
[09:53:13][Step 1/1] [main] DEBUG org.apache.maven.lifecycle.internal.LifecycleDebugLogger - === REACTOR BUILD PLAN ================================================
[09:53:13][Step 1/1] [main] DEBUG org.apache.maven.lifecycle.internal.LifecycleDebugLogger - Project: com.su:MainProject:pom:1.0-SNAPSHOT
[09:53:13][Step 1/1] [main] DEBUG org.apache.maven.lifecycle.internal.LifecycleDebugLogger - Tasks:   [deploy]
[09:53:13][Step 1/1] [main] DEBUG org.apache.maven.lifecycle.internal.LifecycleDebugLogger - Style:   Regular
[09:53:13][Step 1/1] [main] DEBUG org.apache.maven.lifecycle.internal.LifecycleDebugLogger - -----------------------------------------------------------------------
[09:53:13][Step 1/1] [main] DEBUG org.apache.maven.lifecycle.internal.LifecycleDebugLogger - Project: com.su:employee:jar:1.0-SNAPSHOT
[09:53:13][Step 1/1] [main] DEBUG org.apache.maven.lifecycle.internal.LifecycleDebugLogger - Tasks:   [deploy]
[09:53:13][Step 1/1] [main] DEBUG org.apache.maven.lifecycle.internal.LifecycleDebugLogger - Style:   Regular
[09:53:13][Step 1/1] [main] DEBUG org.apache.maven.lifecycle.internal.LifecycleDebugLogger - -----------------------------------------------------------------------
[09:53:13][Step 1/1] [main] DEBUG org.apache.maven.lifecycle.internal.LifecycleDebugLogger - Project: com.su:SpringOne:jar:1.0-SNAPSHOT
[09:53:13][Step 1/1] [main] DEBUG org.apache.maven.lifecycle.internal.LifecycleDebugLogger - Tasks:   [deploy]
[09:53:13][Step 1/1] [main] DEBUG org.apache.maven.lifecycle.internal.LifecycleDebugLogger - Style:   Regular
[09:53:13][Step 1/1] [main] DEBUG org.apache.maven.lifecycle.internal.LifecycleDebugLogger - =======================================================================
[09:53:13][Step 1/1] [main] INFO org.apache.maven.cli.event.ExecutionEventLogger -                                                                         
[09:53:13][Step 1/1] [main] INFO org.apache.maven.cli.event.ExecutionEventLogger - ------------------------------------------------------------------------
[09:53:13][Step 1/1] [main] INFO org.apache.maven.cli.event.ExecutionEventLogger - Building MainProject 1.0-SNAPSHOT
[09:53:13][Step 1/1] [main] INFO org.apache.maven.cli.event.ExecutionEventLogger - ------------------------------------------------------------------------
[09:53:13][Step 1/1] [main] DEBUG org.apache.maven.lifecycle.DefaultLifecycles - Lifecycle default -> [validate, initialize, generate-sources, process-sources, generate-resources, process-resources, compile, process-classes, generate-test-sources, process-test-sources, generate-test-resources, process-test-resources, test-compile, process-test-classes, test, prepare-package, package, pre-integration-test, integration-test, post-integration-test, verify, install, deploy]
[09:53:13][Step 1/1] [main] DEBUG org.apache.maven.lifecycle.DefaultLifecycles - Lifecycle clean -> [pre-clean, clean, post-clean]
[09:53:13][Step 1/1] com.su:MainProject (1s)
[09:53:13][com.su:MainProject] [main] DEBUG org.apache.maven.lifecycle.DefaultLifecycles - Lifecycle site -> [pre-site, site, post-site, site-deploy]
[09:53:13][com.su:MainProject] Importing data from 'C:/TeamCity/buildAgent/work/473a7ed72e7b745e/target/surefire-reports/TEST-*.xml' (not existing file) with 'surefire' processor
[09:53:13][com.su:MainProject] Surefire report watcher
[09:53:14][com.su:MainProject] [main] DEBUG org.apache.maven.lifecycle.DefaultLifecycles - Lifecycle default -> [validate, initialize, generate-sources, process-sources, generate-resources, process-resources, compile, process-classes, generate-test-sources, process-test-sources, generate-test-resources, process-test-resources, test-compile, process-test-classes, test, prepare-package, package, pre-integration-test, integration-test, post-integration-test, verify, install, deploy]
[09:53:14][com.su:MainProject] [main] DEBUG org.apache.maven.lifecycle.DefaultLifecycles - Lifecycle clean -> [pre-clean, clean, post-clean]
[09:53:14][com.su:MainProject] [main] DEBUG org.apache.maven.lifecycle.DefaultLifecycles - Lifecycle site -> [pre-site, site, post-site, site-deploy]
[09:53:14][com.su:MainProject] [main] DEBUG org.apache.maven.lifecycle.DefaultLifecycles - Lifecycle default -> [validate, initialize, generate-sources, process-sources, generate-resources, process-resources, compile, process-classes, generate-test-sources, process-test-sources, generate-test-resources, process-test-resources, test-compile, process-test-classes, test, prepare-package, package, pre-integration-test, integration-test, post-integration-test, verify, install, deploy]
[09:53:14][com.su:MainProject] [main] DEBUG org.apache.maven.lifecycle.DefaultLifecycles - Lifecycle clean -> [pre-clean, clean, post-clean]
[09:53:14][com.su:MainProject] [main] DEBUG org.apache.maven.lifecycle.DefaultLifecycles - Lifecycle site -> [pre-site, site, post-site, site-deploy]
[09:53:14][com.su:MainProject] [main] DEBUG org.apache.maven.lifecycle.internal.LifecycleDebugLogger - === PROJECT BUILD PLAN ================================================
[09:53:14][com.su:MainProject] [main] DEBUG org.apache.maven.lifecycle.internal.LifecycleDebugLogger - Project:       com.su:MainProject:1.0-SNAPSHOT
[09:53:14][com.su:MainProject] [main] DEBUG org.apache.maven.lifecycle.internal.LifecycleDebugLogger - Dependencies (collect): []
[09:53:14][com.su:MainProject] [main] DEBUG org.apache.maven.lifecycle.internal.LifecycleDebugLogger - Dependencies (resolve): []
[09:53:14][com.su:MainProject] [main] DEBUG org.apache.maven.lifecycle.internal.LifecycleDebugLogger - Repositories (dependencies): [central (http://repo.maven.apache.org/maven2, releases)]
[09:53:14][com.su:MainProject] [main] DEBUG org.apache.maven.lifecycle.internal.LifecycleDebugLogger - Repositories (plugins)     : [central (http://repo.maven.apache.org/maven2, releases)]
[09:53:14][com.su:MainProject] [main] DEBUG org.apache.maven.lifecycle.internal.LifecycleDebugLogger - -----------------------------------------------------------------------
[09:53:14][com.su:MainProject] [main] DEBUG org.apache.maven.lifecycle.internal.LifecycleDebugLogger - Goal:          org.apache.maven.plugins:maven-install-plugin:2.4:install (default-install)
[09:53:14][com.su:MainProject] [main] DEBUG org.apache.maven.lifecycle.internal.LifecycleDebugLogger - Style:         Regular
[09:53:14][com.su:MainProject] [main] DEBUG org.apache.maven.lifecycle.internal.LifecycleDebugLogger - Configuration: <?xml version="1.0" encoding="UTF-8"?>
[09:53:14][com.su:MainProject] <configuration>
[09:53:14][com.su:MainProject]   <artifact default-value="${project.artifact}"/>
[09:53:14][com.su:MainProject]   <attachedArtifacts default-value="${project.attachedArtifacts}"/>
[09:53:14][com.su:MainProject]   <createChecksum default-value="false">${createChecksum}</createChecksum>
[09:53:14][com.su:MainProject]   <localRepository>${localRepository}</localRepository>
[09:53:14][com.su:MainProject]   <packaging default-value="${project.packaging}"/>
[09:53:14][com.su:MainProject]   <pomFile default-value="${project.file}"/>
[09:53:14][com.su:MainProject]   <skip default-value="false">${maven.install.skip}</skip>
[09:53:14][com.su:MainProject]   <updateReleaseInfo default-value="false">${updateReleaseInfo}</updateReleaseInfo>
[09:53:14][com.su:MainProject] </configuration>
[09:53:14][com.su:MainProject] [main] DEBUG org.apache.maven.lifecycle.internal.LifecycleDebugLogger - -----------------------------------------------------------------------
[09:53:14][com.su:MainProject] [main] DEBUG org.apache.maven.lifecycle.internal.LifecycleDebugLogger - Goal:          org.apache.maven.plugins:maven-deploy-plugin:2.7:deploy (default-deploy)
[09:53:14][com.su:MainProject] [main] DEBUG org.apache.maven.lifecycle.internal.LifecycleDebugLogger - Style:         Regular
[09:53:14][com.su:MainProject] [main] DEBUG org.apache.maven.lifecycle.internal.LifecycleDebugLogger - Configuration: <?xml version="1.0" encoding="UTF-8"?>
[09:53:14][com.su:MainProject] <configuration>
[09:53:14][com.su:MainProject]   <altDeploymentRepository>${altDeploymentRepository}</altDeploymentRepository>
[09:53:14][com.su:MainProject]   <artifact default-value="${project.artifact}"/>
[09:53:14][com.su:MainProject]   <attachedArtifacts default-value="${project.attachedArtifacts}"/>
[09:53:14][com.su:MainProject]   <localRepository default-value="${localRepository}"/>
[09:53:14][com.su:MainProject]   <offline default-value="${settings.offline}"/>
[09:53:14][com.su:MainProject]   <packaging default-value="${project.packaging}"/>
[09:53:14][com.su:MainProject]   <pomFile default-value="${project.file}"/>
[09:53:14][com.su:MainProject]   <project default-value="${project}"/>
[09:53:14][com.su:MainProject]   <retryFailedDeploymentCount default-value="1">${retryFailedDeploymentCount}</retryFailedDeploymentCount>
[09:53:14][com.su:MainProject]   <skip default-value="false">${maven.deploy.skip}</skip>
[09:53:14][com.su:MainProject]   <updateReleaseInfo default-value="false">${updateReleaseInfo}</updateReleaseInfo>
[09:53:14][com.su:MainProject] </configuration>
[09:53:14][com.su:MainProject] [main] DEBUG org.apache.maven.lifecycle.internal.LifecycleDebugLogger - =======================================================================
[09:53:14][com.su:MainProject] [main] INFO org.apache.maven.cli.event.ExecutionEventLogger -
[09:53:14][com.su:MainProject] [main] INFO org.apache.maven.cli.event.ExecutionEventLogger - --- maven-install-plugin:2.4:install (default-install) @ MainProject ---
[09:53:14][com.su:MainProject] [main] DEBUG org.apache.maven.classrealm.DefaultClassRealmManager - Created new class realm maven.api
[09:53:14][com.su:MainProject] [main] DEBUG org.apache.maven.classrealm.DefaultClassRealmManager - Importing foreign packages into class realm maven.api
[09:53:14][com.su:MainProject] [main] DEBUG org.apache.maven.classrealm.DefaultClassRealmManager -   Imported: org.apache.maven.wagon.events < plexus.core
[09:53:14][com.su:MainProject] [main] DEBUG org.apache.maven.classrealm.DefaultClassRealmManager -   Imported: org.eclipse.aether.impl < plexus.core
[09:53:14][com.su:MainProject] [main] DEBUG org.apache.maven.classrealm.DefaultClassRealmManager -   Imported: org.apache.maven.exception < plexus.core
[09:53:14][com.su:MainProject] [main] DEBUG org.apache.maven.classrealm.DefaultClassRealmManager -   Imported: org.codehaus.plexus.util.xml.Xpp3Dom < plexus.core
[09:53:14][com.su:MainProject] [main] DEBUG org.apache.maven.classrealm.DefaultClassRealmManager -   Imported: org.eclipse.aether.version < plexus.core
[09:53:14][com.su:MainProject] [main] DEBUG org.apache.maven.classrealm.DefaultClassRealmManager -   Imported: org.eclipse.aether.metadata < plexus.core
[09:53:14][com.su:MainProject] [main] DEBUG org.apache.maven.classrealm.DefaultClassRealmManager -   Imported: org.eclipse.aether.collection < plexus.core
[09:53:14][com.su:MainProject] [main] DEBUG org.apache.maven.classrealm.DefaultClassRealmManager -   Imported: org.apache.maven.monitor < plexus.core
[09:53:14][com.su:MainProject] [main] DEBUG org.apache.maven.classrealm.DefaultClassRealmManager -   Imported: org.apache.maven.wagon.repository < plexus.core
[09:53:14][com.su:MainProject] [main] DEBUG org.apache.maven.classrealm.DefaultClassRealmManager -   Imported: org.apache.maven.repository < plexus.core
[09:53:14][com.su:MainProject] [main] DEBUG org.apache.maven.classrealm.DefaultClassRealmManager -   Imported: org.apache.maven.wagon.resource < plexus.core
[09:53:14][com.su:MainProject] [main] DEBUG org.apache.maven.classrealm.DefaultClassRealmManager -   Imported: org.codehaus.plexus.logging < plexus.core
[09:53:14][com.su:MainProject] [main] DEBUG org.apache.maven.classrealm.DefaultClassRealmManager -   Imported: org.apache.maven.profiles < plexus.core
[09:53:14][com.su:MainProject] [main] DEBUG org.apache.maven.classrealm.DefaultClassRealmManager -   Imported: org.apache.maven.classrealm < plexus.core
[09:53:14][com.su:MainProject] [main] DEBUG org.apache.maven.classrealm.DefaultClassRealmManager -   Imported: org.eclipse.aether.artifact < plexus.core
[09:53:14][com.su:MainProject] [main] DEBUG org.apache.maven.classrealm.DefaultClassRealmManager -   Imported: org.apache.maven.execution < plexus.core
[09:53:14][com.su:MainProject] [main] DEBUG org.apache.maven.classrealm.DefaultClassRealmManager -   Imported: org.apache.maven.reporting < plexus.core
[09:53:14][com.su:MainProject] [main] DEBUG org.apache.maven.classrealm.DefaultClassRealmManager -   Imported: org.apache.maven.usability < plexus.core
[09:53:14][com.su:MainProject] [main] DEBUG org.apache.maven.classrealm.DefaultClassRealmManager -   Imported: org.codehaus.plexus.container < plexus.core
[09:53:14][com.su:MainProject] [main] DEBUG org.apache.maven.classrealm.DefaultClassRealmManager -   Imported: org.codehaus.plexus.component < plexus.core
[09:53:14][com.su:MainProject] [main] DEBUG org.apache.maven.classrealm.DefaultClassRealmManager -   Imported: org.eclipse.aether.transfer < plexus.core
[09:53:14][com.su:MainProject] [main] DEBUG org.apache.maven.classrealm.DefaultClassRealmManager -   Imported: org.apache.maven.wagon.authentication < plexus.core
[09:53:14][com.su:MainProject] [main] DEBUG org.apache.maven.classrealm.DefaultClassRealmManager -   Imported: org.codehaus.plexus.util.xml.pull.XmlSerializer < plexus.core
[09:53:14][com.su:MainProject] [main] DEBUG org.apache.maven.classrealm.DefaultClassRealmManager -   Imported: org.apache.maven.lifecycle < plexus.core
[09:53:14][com.su:MainProject] [main] DEBUG org.apache.maven.classrealm.DefaultClassRealmManager -   Imported: org.eclipse.aether.* < plexus.core
[09:53:14][com.su:MainProject] [main] DEBUG org.apache.maven.classrealm.DefaultClassRealmManager -   Imported: org.eclipse.aether.graph < plexus.core
[09:53:14][com.su:MainProject] [main] DEBUG org.apache.maven.classrealm.DefaultClassRealmManager -   Imported: org.codehaus.plexus.classworlds < plexus.core
[09:53:14][com.su:MainProject] [main] DEBUG org.apache.maven.classrealm.DefaultClassRealmManager -   Imported: org.eclipse.aether.internal.impl < plexus.core
[09:53:14][com.su:MainProject] [main] DEBUG org.apache.maven.classrealm.DefaultClassRealmManager -   Imported: org.eclipse.aether.repository < plexus.core
[09:53:14][com.su:MainProject] [main] DEBUG org.apache.maven.classrealm.DefaultClassRealmManager -   Imported: org.eclipse.aether.resolution < plexus.core
[09:53:14][com.su:MainProject] [main] DEBUG org.apache.maven.classrealm.DefaultClassRealmManager -   Imported: javax.inject.* < plexus.core
[09:53:14][com.su:MainProject] [main] DEBUG org.apache.maven.classrealm.DefaultClassRealmManager -   Imported: org.apache.maven.settings < plexus.core
[09:53:14][com.su:MainProject] [main] DEBUG org.apache.maven.classrealm.DefaultClassRealmManager -   Imported: org.codehaus.classworlds < plexus.core
[09:53:14][com.su:MainProject] [main] DEBUG org.apache.maven.classrealm.DefaultClassRealmManager -   Imported: org.apache.maven.wagon.* < plexus.core
[09:53:14][com.su:MainProject] [main] DEBUG org.apache.maven.classrealm.DefaultClassRealmManager -   Imported: org.apache.maven.toolchain < plexus.core
[09:53:14][com.su:MainProject] [main] DEBUG org.apache.maven.classrealm.DefaultClassRealmManager -   Imported: org.eclipse.aether.spi < plexus.core
[09:53:14][com.su:MainProject] [main] DEBUG org.apache.maven.classrealm.DefaultClassRealmManager -   Imported: org.apache.maven.wagon.observers < plexus.core
[09:53:14][com.su:MainProject] [main] DEBUG org.apache.maven.classrealm.DefaultClassRealmManager -   Imported: org.codehaus.plexus.util.xml.pull.XmlPullParserException < plexus.core
[09:53:14][com.su:MainProject] [main] DEBUG org.apache.maven.classrealm.DefaultClassRealmManager -   Imported: org.codehaus.plexus.util.xml.pull.XmlPullParser < plexus.core
[09:53:14][com.su:MainProject] [main] DEBUG org.apache.maven.classrealm.DefaultClassRealmManager -   Imported: org.apache.maven.configuration < plexus.core
[09:53:14][com.su:MainProject] [main] DEBUG org.apache.maven.classrealm.DefaultClassRealmManager -   Imported: org.apache.maven.cli < plexus.core
[09:53:14][com.su:MainProject] [main] DEBUG org.apache.maven.classrealm.DefaultClassRealmManager -   Imported: org.codehaus.plexus.context < plexus.core
[09:53:14][com.su:MainProject] [main] DEBUG org.apache.maven.classrealm.DefaultClassRealmManager -   Imported: org.apache.maven.wagon.authorization < plexus.core
[09:53:14][com.su:MainProject] [main] DEBUG org.apache.maven.classrealm.DefaultClassRealmManager -   Imported: org.apache.maven.project < plexus.core
[09:53:14][com.su:MainProject] [main] DEBUG org.apache.maven.classrealm.DefaultClassRealmManager -   Imported: org.eclipse.aether.installation < plexus.core
[09:53:14][com.su:MainProject] [main] DEBUG org.apache.maven.classrealm.DefaultClassRealmManager -   Imported: org.eclipse.aether.deployment < plexus.core
[09:53:14][com.su:MainProject] [main] DEBUG org.apache.maven.classrealm.DefaultClassRealmManager -   Imported: org.codehaus.plexus.lifecycle < plexus.core
[09:53:14][com.su:MainProject] [main] DEBUG org.apache.maven.classrealm.DefaultClassRealmManager -   Imported: org.apache.maven.rtinfo < plexus.core
[09:53:14][com.su:MainProject] [main] DEBUG org.apache.maven.classrealm.DefaultClassRealmManager -   Imported: org.codehaus.plexus.configuration < plexus.core
[09:53:14][com.su:MainProject] [main] DEBUG org.apache.maven.classrealm.DefaultClassRealmManager -   Imported: org.apache.maven.artifact < plexus.core
[09:53:14][com.su:MainProject] [main] DEBUG org.apache.maven.classrealm.DefaultClassRealmManager -   Imported: org.apache.maven.model < plexus.core
[09:53:14][com.su:MainProject] [main] DEBUG org.apache.maven.classrealm.DefaultClassRealmManager -   Imported: org.slf4j.* < plexus.core
[09:53:14][com.su:MainProject] [main] DEBUG org.apache.maven.classrealm.DefaultClassRealmManager -   Imported: javax.enterprise.inject.* < plexus.core
[09:53:14][com.su:MainProject] [main] DEBUG org.apache.maven.classrealm.DefaultClassRealmManager -   Imported: org.apache.maven.* < plexus.core
[09:53:14][com.su:MainProject] [main] DEBUG org.apache.maven.classrealm.DefaultClassRealmManager -   Imported: org.apache.maven.wagon.proxy < plexus.core
[09:53:14][com.su:MainProject] [main] DEBUG org.apache.maven.classrealm.DefaultClassRealmManager -   Imported: org.apache.maven.plugin < plexus.core
[09:53:14][com.su:MainProject] [main] DEBUG org.apache.maven.classrealm.DefaultClassRealmManager -   Imported: org.codehaus.plexus.* < plexus.core
[09:53:14][com.su:MainProject] [main] DEBUG org.apache.maven.classrealm.DefaultClassRealmManager -   Imported: org.codehaus.plexus.personality < plexus.core
[09:53:14][com.su:MainProject] [main] DEBUG org.apache.maven.classrealm.DefaultClassRealmManager - Populating class realm maven.api
[09:53:14][com.su:MainProject] [main] DEBUG org.eclipse.aether.internal.impl.DefaultDependencyCollector - Dependency collection stats: {ConflictMarker.analyzeTime=1, ConflictMarker.markTime=0, ConflictMarker.nodeCount=38, ConflictIdSorter.graphTime=0, ConflictIdSorter.topsortTime=1, ConflictIdSorter.conflictIdCount=15, ConflictIdSorter.conflictIdCycleCount=0, ConflictResolver.totalTime=4, ConflictResolver.conflictItemCount=35, DefaultDependencyCollector.collectTime=155, DefaultDependencyCollector.transformTime=9}
[09:53:14][com.su:MainProject] [main] DEBUG org.apache.maven.plugin.internal.DefaultPluginDependenciesResolver - org.apache.maven.plugins:maven-install-plugin:jar:2.4:
[09:53:14][com.su:MainProject] [main] DEBUG org.apache.maven.plugin.internal.DefaultPluginDependenciesResolver -    org.apache.maven:maven-plugin-api:jar:2.0.6:compile
[09:53:14][com.su:MainProject] [main] DEBUG org.apache.maven.plugin.internal.DefaultPluginDependenciesResolver -    org.apache.maven:maven-project:jar:2.0.6:compile
[09:53:14][com.su:MainProject] [main] DEBUG org.apache.maven.plugin.internal.DefaultPluginDependenciesResolver -       org.apache.maven:maven-settings:jar:2.0.6:compile
[09:53:14][com.su:MainProject] [main] DEBUG org.apache.maven.plugin.internal.DefaultPluginDependenciesResolver -       org.apache.maven:maven-profile:jar:2.0.6:compile
[09:53:14][com.su:MainProject] [main] DEBUG org.apache.maven.plugin.internal.DefaultPluginDependenciesResolver -       org.apache.maven:maven-plugin-registry:jar:2.0.6:compile
[09:53:14][com.su:MainProject] [main] DEBUG org.apache.maven.plugin.internal.DefaultPluginDependenciesResolver -       org.codehaus.plexus:plexus-container-default:jar:1.0-alpha-9-stable-1:compile
[09:53:14][com.su:MainProject] [main] DEBUG org.apache.maven.plugin.internal.DefaultPluginDependenciesResolver -          junit:junit:jar:3.8.1:compile
[09:53:14][com.su:MainProject] [main] DEBUG org.apache.maven.plugin.internal.DefaultPluginDependenciesResolver -          classworlds:classworlds:jar:1.1-alpha-2:compile
[09:53:14][com.su:MainProject] [main] DEBUG org.apache.maven.plugin.internal.DefaultPluginDependenciesResolver -    org.apache.maven:maven-model:jar:2.0.6:compile
[09:53:14][com.su:MainProject] [main] DEBUG org.apache.maven.plugin.internal.DefaultPluginDependenciesResolver -    org.apache.maven:maven-artifact-manager:jar:2.0.6:compile
[09:53:14][com.su:MainProject] [main] DEBUG org.apache.maven.plugin.internal.DefaultPluginDependenciesResolver -       org.apache.maven:maven-repository-metadata:jar:2.0.6:compile
[09:53:14][com.su:MainProject] [main] DEBUG org.apache.maven.plugin.internal.DefaultPluginDependenciesResolver -    org.apache.maven:maven-artifact:jar:2.0.6:compile
[09:53:14][com.su:MainProject] [main] DEBUG org.apache.maven.plugin.internal.DefaultPluginDependenciesResolver -    org.codehaus.plexus:plexus-utils:jar:3.0.5:compile
[09:53:14][com.su:MainProject] [main] DEBUG org.apache.maven.plugin.internal.DefaultPluginDependenciesResolver -    org.codehaus.plexus:plexus-digest:jar:1.0:compile
[09:53:14][com.su:MainProject] [main] DEBUG org.apache.maven.classrealm.DefaultClassRealmManager - Created new class realm plugin>org.apache.maven.plugins:maven-install-plugin:2.4
[09:53:14][com.su:MainProject] [main] DEBUG org.apache.maven.classrealm.DefaultClassRealmManager - Importing foreign packages into class realm plugin>org.apache.maven.plugins:maven-install-plugin:2.4
[09:53:14][com.su:MainProject] [main] DEBUG org.apache.maven.classrealm.DefaultClassRealmManager -   Imported:  < maven.api
[09:53:14][com.su:MainProject] [main] DEBUG org.apache.maven.classrealm.DefaultClassRealmManager - Populating class realm plugin>org.apache.maven.plugins:maven-install-plugin:2.4
[09:53:14][com.su:MainProject] [main] DEBUG org.apache.maven.classrealm.DefaultClassRealmManager -   Included: org.apache.maven.plugins:maven-install-plugin:jar:2.4
[09:53:14][com.su:MainProject] [main] DEBUG org.apache.maven.classrealm.DefaultClassRealmManager -   Included: junit:junit:jar:3.8.1
[09:53:14][com.su:MainProject] [main] DEBUG org.apache.maven.classrealm.DefaultClassRealmManager -   Included: org.codehaus.plexus:plexus-utils:jar:3.0.5
[09:53:14][com.su:MainProject] [main] DEBUG org.apache.maven.classrealm.DefaultClassRealmManager -   Included: org.codehaus.plexus:plexus-digest:jar:1.0
[09:53:14][com.su:MainProject] [main] DEBUG org.apache.maven.classrealm.DefaultClassRealmManager -   Excluded: org.apache.maven:maven-plugin-api:jar:2.0.6
[09:53:14][com.su:MainProject] [main] DEBUG org.apache.maven.classrealm.DefaultClassRealmManager -   Excluded: org.apache.maven:maven-project:jar:2.0.6
[09:53:14][com.su:MainProject] [main] DEBUG org.apache.maven.classrealm.DefaultClassRealmManager -   Excluded: org.apache.maven:maven-settings:jar:2.0.6
[09:53:14][com.su:MainProject] [main] DEBUG org.apache.maven.classrealm.DefaultClassRealmManager -   Excluded: org.apache.maven:maven-profile:jar:2.0.6
[09:53:14][com.su:MainProject] [main] DEBUG org.apache.maven.classrealm.DefaultClassRealmManager -   Excluded: org.apache.maven:maven-plugin-registry:jar:2.0.6
[09:53:14][com.su:MainProject] [main] DEBUG org.apache.maven.classrealm.DefaultClassRealmManager -   Excluded: org.codehaus.plexus:plexus-container-default:jar:1.0-alpha-9-stable-1
[09:53:14][com.su:MainProject] [main] DEBUG org.apache.maven.classrealm.DefaultClassRealmManager -   Excluded: classworlds:classworlds:jar:1.1-alpha-2
[09:53:14][com.su:MainProject] [main] DEBUG org.apache.maven.classrealm.DefaultClassRealmManager -   Excluded: org.apache.maven:maven-model:jar:2.0.6
[09:53:14][com.su:MainProject] [main] DEBUG org.apache.maven.classrealm.DefaultClassRealmManager -   Excluded: org.apache.maven:maven-artifact-manager:jar:2.0.6
[09:53:14][com.su:MainProject] [main] DEBUG org.apache.maven.classrealm.DefaultClassRealmManager -   Excluded: org.apache.maven:maven-repository-metadata:jar:2.0.6
[09:53:14][com.su:MainProject] [main] DEBUG org.apache.maven.classrealm.DefaultClassRealmManager -   Excluded: org.apache.maven:maven-artifact:jar:2.0.6
[09:53:14][com.su:MainProject] [main] DEBUG org.apache.maven.plugin.internal.DefaultMavenPluginManager - Configuring mojo org.apache.maven.plugins:maven-install-plugin:2.4:install from plugin realm ClassRealm[plugin>org.apache.maven.plugins:maven-install-plugin:2.4, parent: sun.misc.Launcher$AppClassLoader@1497b7b1]
[09:53:14][com.su:MainProject] [main] DEBUG org.apache.maven.plugin.internal.DefaultMavenPluginManager - Configuring mojo 'org.apache.maven.plugins:maven-install-plugin:2.4:install' with basic configurator -->
[09:53:14][com.su:MainProject] [main] DEBUG org.apache.maven.plugin.internal.DefaultMavenPluginManager -   (f) artifact = com.su:MainProject:pom:1.0-SNAPSHOT
[09:53:14][com.su:MainProject] [main] DEBUG org.apache.maven.plugin.internal.DefaultMavenPluginManager -   (f) attachedArtifacts = []
[09:53:14][com.su:MainProject] [main] DEBUG org.apache.maven.plugin.internal.DefaultMavenPluginManager -   (f) createChecksum = false
[09:53:14][com.su:MainProject] [main] DEBUG org.apache.maven.plugin.internal.DefaultMavenPluginManager -   (f) localRepository =        id: local
[09:53:14][com.su:MainProject]       url: file:///C:/.m2/repository/
[09:53:14][com.su:MainProject]    layout: none
[09:53:14][com.su:MainProject]
[09:53:14][com.su:MainProject] [main] DEBUG org.apache.maven.plugin.internal.DefaultMavenPluginManager -   (f) packaging = pom
[09:53:14][com.su:MainProject] [main] DEBUG org.apache.maven.plugin.internal.DefaultMavenPluginManager -   (f) pomFile = C:\TeamCity\buildAgent\work\473a7ed72e7b745e\pom.xml
[09:53:14][com.su:MainProject] [main] DEBUG org.apache.maven.plugin.internal.DefaultMavenPluginManager -   (s) skip = false
[09:53:14][com.su:MainProject] [main] DEBUG org.apache.maven.plugin.internal.DefaultMavenPluginManager -   (f) updateReleaseInfo = false
[09:53:14][com.su:MainProject] [main] DEBUG org.apache.maven.plugin.internal.DefaultMavenPluginManager - -- end configuration --
[09:53:14][com.su:MainProject] [main] INFO org.apache.maven.DefaultMaven - Installing C:\TeamCity\buildAgent\work\473a7ed72e7b745e\pom.xml to C:\.m2\repository\com\su\MainProject\1.0-SNAPSHOT\MainProject-1.0-SNAPSHOT.pom
[09:53:14][com.su:MainProject] [main] DEBUG org.eclipse.aether.internal.impl.EnhancedLocalRepositoryManager - Writing tracking file C:\.m2\repository\com\su\MainProject\1.0-SNAPSHOT\_remote.repositories
[09:53:14][com.su:MainProject] [main] DEBUG org.apache.maven.DefaultMaven - Installing com.su:MainProject:1.0-SNAPSHOT/maven-metadata.xml to C:\.m2\repository\com\su\MainProject\1.0-SNAPSHOT\maven-metadata-local.xml
[09:53:14][com.su:MainProject] [main] DEBUG org.apache.maven.DefaultMaven - Installing com.su:MainProject/maven-metadata.xml to C:\.m2\repository\com\su\MainProject\maven-metadata-local.xml
[09:53:14][com.su:MainProject] [main] INFO org.apache.maven.cli.event.ExecutionEventLogger -
[09:53:14][com.su:MainProject] [main] INFO org.apache.maven.cli.event.ExecutionEventLogger - --- maven-deploy-plugin:2.7:deploy (default-deploy) @ MainProject ---
[09:53:14][com.su:MainProject] [main] DEBUG org.eclipse.aether.internal.impl.DefaultDependencyCollector - Dependency collection stats: {ConflictMarker.analyzeTime=0, ConflictMarker.markTime=1, ConflictMarker.nodeCount=32, ConflictIdSorter.graphTime=0, ConflictIdSorter.topsortTime=0, ConflictIdSorter.conflictIdCount=14, ConflictIdSorter.conflictIdCycleCount=0, ConflictResolver.totalTime=1, ConflictResolver.conflictItemCount=32, DefaultDependencyCollector.collectTime=29, DefaultDependencyCollector.transformTime=2}
[09:53:14][com.su:MainProject] [main] DEBUG org.apache.maven.plugin.internal.DefaultPluginDependenciesResolver - org.apache.maven.plugins:maven-deploy-plugin:jar:2.7:
[09:53:14][com.su:MainProject] [main] DEBUG org.apache.maven.plugin.internal.DefaultPluginDependenciesResolver -    org.apache.maven:maven-plugin-api:jar:2.0.6:compile
[09:53:14][com.su:MainProject] [main] DEBUG org.apache.maven.plugin.internal.DefaultPluginDependenciesResolver -    org.apache.maven:maven-project:jar:2.0.6:compile
[09:53:14][com.su:MainProject] [main] DEBUG org.apache.maven.plugin.internal.DefaultPluginDependenciesResolver -       org.apache.maven:maven-settings:jar:2.0.6:compile
[09:53:14][com.su:MainProject] [main] DEBUG org.apache.maven.plugin.internal.DefaultPluginDependenciesResolver -       org.apache.maven:maven-profile:jar:2.0.6:compile
[09:53:14][com.su:MainProject] [main] DEBUG org.apache.maven.plugin.internal.DefaultPluginDependenciesResolver -       org.apache.maven:maven-artifact-manager:jar:2.0.6:compile
[09:53:14][com.su:MainProject] [main] DEBUG org.apache.maven.plugin.internal.DefaultPluginDependenciesResolver -          org.apache.maven:maven-repository-metadata:jar:2.0.6:compile
[09:53:14][com.su:MainProject] [main] DEBUG org.apache.maven.plugin.internal.DefaultPluginDependenciesResolver -       org.apache.maven:maven-plugin-registry:jar:2.0.6:compile
[09:53:14][com.su:MainProject] [main] DEBUG org.apache.maven.plugin.internal.DefaultPluginDependenciesResolver -       org.codehaus.plexus:plexus-container-default:jar:1.0-alpha-9-stable-1:compile
[09:53:14][com.su:MainProject] [main] DEBUG org.apache.maven.plugin.internal.DefaultPluginDependenciesResolver -          junit:junit:jar:3.8.1:compile
[09:53:14][com.su:MainProject] [main] DEBUG org.apache.maven.plugin.internal.DefaultPluginDependenciesResolver -          classworlds:classworlds:jar:1.1-alpha-2:compile
[09:53:14][com.su:MainProject] [main] DEBUG org.apache.maven.plugin.internal.DefaultPluginDependenciesResolver -    org.apache.maven:maven-model:jar:2.0.6:compile
[09:53:14][com.su:MainProject] [main] DEBUG org.apache.maven.plugin.internal.DefaultPluginDependenciesResolver -    org.apache.maven:maven-artifact:jar:2.0.6:compile
[09:53:14][com.su:MainProject] [main] DEBUG org.apache.maven.plugin.internal.DefaultPluginDependenciesResolver -    org.codehaus.plexus:plexus-utils:jar:1.5.6:compile
[09:53:14][com.su:MainProject] [main] DEBUG org.apache.maven.classrealm.DefaultClassRealmManager - Created new class realm plugin>org.apache.maven.plugins:maven-deploy-plugin:2.7
[09:53:14][com.su:MainProject] [main] DEBUG org.apache.maven.classrealm.DefaultClassRealmManager - Importing foreign packages into class realm plugin>org.apache.maven.plugins:maven-deploy-plugin:2.7
[09:53:14][com.su:MainProject] [main] DEBUG org.apache.maven.classrealm.DefaultClassRealmManager -   Imported:  < maven.api
[09:53:14][com.su:MainProject] [main] DEBUG org.apache.maven.classrealm.DefaultClassRealmManager - Populating class realm plugin>org.apache.maven.plugins:maven-deploy-plugin:2.7
[09:53:14][com.su:MainProject] [main] DEBUG org.apache.maven.classrealm.DefaultClassRealmManager -   Included: org.apache.maven.plugins:maven-deploy-plugin:jar:2.7
[09:53:14][com.su:MainProject] [main] DEBUG org.apache.maven.classrealm.DefaultClassRealmManager -   Included: junit:junit:jar:3.8.1
[09:53:14][com.su:MainProject] [main] DEBUG org.apache.maven.classrealm.DefaultClassRealmManager -   Included: org.codehaus.plexus:plexus-utils:jar:1.5.6
[09:53:14][com.su:MainProject] [main] DEBUG org.apache.maven.classrealm.DefaultClassRealmManager -   Excluded: org.apache.maven:maven-plugin-api:jar:2.0.6
[09:53:14][com.su:MainProject] [main] DEBUG org.apache.maven.classrealm.DefaultClassRealmManager -   Excluded: org.apache.maven:maven-project:jar:2.0.6
[09:53:14][com.su:MainProject] [main] DEBUG org.apache.maven.classrealm.DefaultClassRealmManager -   Excluded: org.apache.maven:maven-settings:jar:2.0.6
[09:53:14][com.su:MainProject] [main] DEBUG org.apache.maven.classrealm.DefaultClassRealmManager -   Excluded: org.apache.maven:maven-profile:jar:2.0.6
[09:53:14][com.su:MainProject] [main] DEBUG org.apache.maven.classrealm.DefaultClassRealmManager -   Excluded: org.apache.maven:maven-artifact-manager:jar:2.0.6
[09:53:14][com.su:MainProject] [main] DEBUG org.apache.maven.classrealm.DefaultClassRealmManager -   Excluded: org.apache.maven:maven-repository-metadata:jar:2.0.6
[09:53:14][com.su:MainProject] [main] DEBUG org.apache.maven.classrealm.DefaultClassRealmManager -   Excluded: org.apache.maven:maven-plugin-registry:jar:2.0.6
[09:53:14][com.su:MainProject] [main] DEBUG org.apache.maven.classrealm.DefaultClassRealmManager -   Excluded: org.codehaus.plexus:plexus-container-default:jar:1.0-alpha-9-stable-1
[09:53:14][com.su:MainProject] [main] DEBUG org.apache.maven.classrealm.DefaultClassRealmManager -   Excluded: classworlds:classworlds:jar:1.1-alpha-2
[09:53:14][com.su:MainProject] [main] DEBUG org.apache.maven.classrealm.DefaultClassRealmManager -   Excluded: org.apache.maven:maven-model:jar:2.0.6
[09:53:14][com.su:MainProject] [main] DEBUG org.apache.maven.classrealm.DefaultClassRealmManager -   Excluded: org.apache.maven:maven-artifact:jar:2.0.6
[09:53:14][com.su:MainProject] [main] DEBUG org.apache.maven.plugin.internal.DefaultMavenPluginManager - Configuring mojo org.apache.maven.plugins:maven-deploy-plugin:2.7:deploy from plugin realm ClassRealm[plugin>org.apache.maven.plugins:maven-deploy-plugin:2.7, parent: sun.misc.Launcher$AppClassLoader@1497b7b1]
[09:53:14][com.su:MainProject] [main] DEBUG org.apache.maven.plugin.internal.DefaultMavenPluginManager - Configuring mojo 'org.apache.maven.plugins:maven-deploy-plugin:2.7:deploy' with basic configurator -->
[09:53:14][com.su:MainProject] [main] DEBUG org.apache.maven.plugin.internal.DefaultMavenPluginManager -   (f) artifact = com.su:MainProject:pom:1.0-SNAPSHOT
[09:53:14][com.su:MainProject] [main] DEBUG org.apache.maven.plugin.internal.DefaultMavenPluginManager -   (f) attachedArtifacts = []
[09:53:14][com.su:MainProject] [main] DEBUG org.apache.maven.plugin.internal.DefaultMavenPluginManager -   (s) localRepository =        id: local
[09:53:14][com.su:MainProject]       url: file:///C:/.m2/repository/
[09:53:14][com.su:MainProject]    layout: none
[09:53:14][com.su:MainProject]
[09:53:14][com.su:MainProject] [main] DEBUG org.apache.maven.plugin.internal.DefaultMavenPluginManager -   (f) offline = false
[09:53:14][com.su:MainProject] [main] DEBUG org.apache.maven.plugin.internal.DefaultMavenPluginManager -   (f) packaging = pom
[09:53:14][com.su:MainProject] [main] DEBUG org.apache.maven.plugin.internal.DefaultMavenPluginManager -   (f) pomFile = C:\TeamCity\buildAgent\work\473a7ed72e7b745e\pom.xml
[09:53:14][com.su:MainProject] [main] DEBUG org.apache.maven.plugin.internal.DefaultMavenPluginManager -   (f) project = MavenProject: com.su:MainProject:1.0-SNAPSHOT @ C:\TeamCity\buildAgent\work\473a7ed72e7b745e\pom.xml
[09:53:14][com.su:MainProject] [main] DEBUG org.apache.maven.plugin.internal.DefaultMavenPluginManager -   (f) retryFailedDeploymentCount = 1
[09:53:14][com.su:MainProject] [main] DEBUG org.apache.maven.plugin.internal.DefaultMavenPluginManager -   (f) skip = false
[09:53:14][com.su:MainProject] [main] DEBUG org.apache.maven.plugin.internal.DefaultMavenPluginManager -   (f) updateReleaseInfo = false
[09:53:14][com.su:MainProject] [main] DEBUG org.apache.maven.plugin.internal.DefaultMavenPluginManager - -- end configuration --
[09:53:14][com.su:MainProject] [main] DEBUG org.eclipse.aether.internal.impl.DefaultRepositoryConnectorProvider - Using connector WagonRepositoryConnector with priority 0.0 for http://jackbiglaptop:8081/nexus/content/repositories/snapshots with username=admin, password=***
[09:53:14][com.su:MainProject] [pool-1-thread-1] INFO org.apache.maven.cli.transfer.Slf4jMavenTransferListener - Downloading: http://jackbiglaptop:8081/nexus/content/repositories/snapshots/com/su/MainProject/1.0-SNAPSHOT/maven-metadata.xml
[09:53:14][com.su:MainProject] [pool-1-thread-1] INFO org.apache.maven.cli.transfer.Slf4jMavenTransferListener - Downloaded: http://jackbiglaptop:8081/nexus/content/repositories/snapshots/com/su/MainProject/1.0-SNAPSHOT/maven-metadata.xml (590 B at 3.5 KB/sec)
[09:53:14][com.su:MainProject] [main] DEBUG org.eclipse.aether.internal.impl.DefaultUpdateCheckManager - Writing tracking file C:\.m2\repository\com\su\MainProject\1.0-SNAPSHOT\resolver-status.properties
[09:53:14][com.su:MainProject] [main] INFO org.apache.maven.cli.transfer.Slf4jMavenTransferListener - Uploading: http://jackbiglaptop:8081/nexus/content/repositories/snapshots/com/su/MainProject/1.0-SNAPSHOT/MainProject-1.0-20131227.145314-7.pom
[09:53:15][com.su:MainProject] [main] INFO org.apache.maven.cli.transfer.Slf4jMavenTransferListener - Uploaded: http://jackbiglaptop:8081/nexus/content/repositories/snapshots/com/su/MainProject/1.0-SNAPSHOT/MainProject-1.0-20131227.145314-7.pom (978 B at 6.7 KB/sec)
[09:53:15][com.su:MainProject] [pool-1-thread-2] INFO org.apache.maven.cli.transfer.Slf4jMavenTransferListener - Downloading: http://jackbiglaptop:8081/nexus/content/repositories/snapshots/com/su/MainProject/maven-metadata.xml
[09:53:15][com.su:MainProject] [pool-1-thread-2] INFO org.apache.maven.cli.transfer.Slf4jMavenTransferListener - Downloaded: http://jackbiglaptop:8081/nexus/content/repositories/snapshots/com/su/MainProject/maven-metadata.xml (275 B at 9.3 KB/sec)
[09:53:15][com.su:MainProject] [main] DEBUG org.eclipse.aether.internal.impl.DefaultUpdateCheckManager - Writing tracking file C:\.m2\repository\com\su\MainProject\resolver-status.properties
[09:53:15][com.su:MainProject] [main] INFO org.apache.maven.cli.transfer.Slf4jMavenTransferListener - Uploading: http://jackbiglaptop:8081/nexus/content/repositories/snapshots/com/su/MainProject/1.0-SNAPSHOT/maven-metadata.xml
[09:53:15][com.su:MainProject] [main] INFO org.apache.maven.cli.transfer.Slf4jMavenTransferListener - Uploaded: http://jackbiglaptop:8081/nexus/content/repositories/snapshots/com/su/MainProject/1.0-SNAPSHOT/maven-metadata.xml (590 B at 6.7 KB/sec)
[09:53:15][com.su:MainProject] [main] INFO org.apache.maven.cli.transfer.Slf4jMavenTransferListener - Uploading: http://jackbiglaptop:8081/nexus/content/repositories/snapshots/com/su/MainProject/maven-metadata.xml
[09:53:15][com.su:MainProject] [main] INFO org.apache.maven.cli.transfer.Slf4jMavenTransferListener - Uploaded: http://jackbiglaptop:8081/nexus/content/repositories/snapshots/com/su/MainProject/maven-metadata.xml (275 B at 3.4 KB/sec)
[09:53:15][com.su:MainProject] [main] INFO org.apache.maven.cli.event.ExecutionEventLogger -                                                                         
[09:53:15][com.su:MainProject] [main] INFO org.apache.maven.cli.event.ExecutionEventLogger - ------------------------------------------------------------------------
[09:53:15][Step 1/1] [main] INFO org.apache.maven.cli.event.ExecutionEventLogger - Building SpringOne 1.0-SNAPSHOT
[09:53:15][Step 1/1] [main] INFO org.apache.maven.cli.event.ExecutionEventLogger - ------------------------------------------------------------------------
[09:53:15][Step 1/1] [main] DEBUG org.apache.maven.lifecycle.DefaultLifecycles - Lifecycle default -> [validate, initialize, generate-sources, process-sources, generate-resources, process-resources, compile, process-classes, generate-test-sources, process-test-sources, generate-test-resources, process-test-resources, test-compile, process-test-classes, test, prepare-package, package, pre-integration-test, integration-test, post-integration-test, verify, install, deploy]
[09:53:15][Step 1/1] com.su:employee (1s)
[09:53:15][com.su:employee] [main] DEBUG org.apache.maven.lifecycle.DefaultLifecycles - Lifecycle clean -> [pre-clean, clean, post-clean]
[09:53:15][com.su:employee] [main] DEBUG org.apache.maven.lifecycle.DefaultLifecycles - Lifecycle site -> [pre-site, site, post-site, site-deploy]
[09:53:15][com.su:employee] Importing data from 'C:/TeamCity/buildAgent/work/473a7ed72e7b745e/employee/target/surefire-reports/TEST-*.xml' (not existing file) with 'surefire' processor
[09:53:15][com.su:employee] [main] DEBUG org.apache.maven.lifecycle.DefaultLifecycles - Lifecycle default -> [validate, initialize, generate-sources, process-sources, generate-resources, process-resources, compile, process-classes, generate-test-sources, process-test-sources, generate-test-resources, process-test-resources, test-compile, process-test-classes, test, prepare-package, package, pre-integration-test, integration-test, post-integration-test, verify, install, deploy]
[09:53:15][com.su:employee] [main] DEBUG org.apache.maven.lifecycle.DefaultLifecycles - Lifecycle clean -> [pre-clean, clean, post-clean]
[09:53:15][com.su:employee] [main] DEBUG org.apache.maven.lifecycle.DefaultLifecycles - Lifecycle site -> [pre-site, site, post-site, site-deploy]
[09:53:15][com.su:employee] [main] DEBUG org.apache.maven.lifecycle.DefaultLifecycles - Lifecycle default -> [validate, initialize, generate-sources, process-sources, generate-resources, process-resources, compile, process-classes, generate-test-sources, process-test-sources, generate-test-resources, process-test-resources, test-compile, process-test-classes, test, prepare-package, package, pre-integration-test, integration-test, post-integration-test, verify, install, deploy]
[09:53:15][com.su:employee] [main] DEBUG org.apache.maven.lifecycle.DefaultLifecycles - Lifecycle clean -> [pre-clean, clean, post-clean]
[09:53:15][com.su:employee] [main] DEBUG org.apache.maven.lifecycle.DefaultLifecycles - Lifecycle site -> [pre-site, site, post-site, site-deploy]
[09:53:15][com.su:employee] [main] DEBUG org.apache.maven.lifecycle.DefaultLifecycles - Lifecycle default -> [validate, initialize, generate-sources, process-sources, generate-resources, process-resources, compile, process-classes, generate-test-sources, process-test-sources, generate-test-resources, process-test-resources, test-compile, process-test-classes, test, prepare-package, package, pre-integration-test, integration-test, post-integration-test, verify, install, deploy]
[09:53:15][com.su:employee] [main] DEBUG org.apache.maven.lifecycle.DefaultLifecycles - Lifecycle clean -> [pre-clean, clean, post-clean]
[09:53:15][com.su:employee] [main] DEBUG org.apache.maven.lifecycle.DefaultLifecycles - Lifecycle site -> [pre-site, site, post-site, site-deploy]
[09:53:15][com.su:employee] [main] DEBUG org.apache.maven.lifecycle.DefaultLifecycles - Lifecycle default -> [validate, initialize, generate-sources, process-sources, generate-resources, process-resources, compile, process-classes, generate-test-sources, process-test-sources, generate-test-resources, process-test-resources, test-compile, process-test-classes, test, prepare-package, package, pre-integration-test, integration-test, post-integration-test, verify, install, deploy]
[09:53:15][com.su:employee] [main] DEBUG org.apache.maven.lifecycle.DefaultLifecycles - Lifecycle clean -> [pre-clean, clean, post-clean]
[09:53:15][com.su:employee] [main] DEBUG org.apache.maven.lifecycle.DefaultLifecycles - Lifecycle site -> [pre-site, site, post-site, site-deploy]
[09:53:15][com.su:employee] [main] DEBUG org.apache.maven.lifecycle.DefaultLifecycles - Lifecycle default -> [validate, initialize, generate-sources, process-sources, generate-resources, process-resources, compile, process-classes, generate-test-sources, process-test-sources, generate-test-resources, process-test-resources, test-compile, process-test-classes, test, prepare-package, package, pre-integration-test, integration-test, post-integration-test, verify, install, deploy]
[09:53:15][com.su:employee] [main] DEBUG org.apache.maven.lifecycle.DefaultLifecycles - Lifecycle clean -> [pre-clean, clean, post-clean]
[09:53:15][com.su:employee] [main] DEBUG org.apache.maven.lifecycle.DefaultLifecycles - Lifecycle site -> [pre-site, site, post-site, site-deploy]
[09:53:15][com.su:employee] [main] DEBUG org.apache.maven.lifecycle.DefaultLifecycles - Lifecycle default -> [validate, initialize, generate-sources, process-sources, generate-resources, process-resources, compile, process-classes, generate-test-sources, process-test-sources, generate-test-resources, process-test-resources, test-compile, process-test-classes, test, prepare-package, package, pre-integration-test, integration-test, post-integration-test, verify, install, deploy]
[09:53:15][com.su:employee] [main] DEBUG org.apache.maven.lifecycle.DefaultLifecycles - Lifecycle clean -> [pre-clean, clean, post-clean]
[09:53:15][com.su:employee] [main] DEBUG org.apache.maven.lifecycle.DefaultLifecycles - Lifecycle site -> [pre-site, site, post-site, site-deploy]
[09:53:15][com.su:employee] [main] DEBUG org.apache.maven.lifecycle.DefaultLifecycles - Lifecycle default -> [validate, initialize, generate-sources, process-sources, generate-resources, process-resources, compile, process-classes, generate-test-sources, process-test-sources, generate-test-resources, process-test-resources, test-compile, process-test-classes, test, prepare-package, package, pre-integration-test, integration-test, post-integration-test, verify, install, deploy]
[09:53:15][com.su:employee] [main] DEBUG org.apache.maven.lifecycle.DefaultLifecycles - Lifecycle clean -> [pre-clean, clean, post-clean]
[09:53:15][com.su:employee] [main] DEBUG org.apache.maven.lifecycle.DefaultLifecycles - Lifecycle site -> [pre-site, site, post-site, site-deploy]
[09:53:15][com.su:employee] [main] DEBUG org.apache.maven.lifecycle.DefaultLifecycles - Lifecycle default -> [validate, initialize, generate-sources, process-sources, generate-resources, process-resources, compile, process-classes, generate-test-sources, process-test-sources, generate-test-resources, process-test-resources, test-compile, process-test-classes, test, prepare-package, package, pre-integration-test, integration-test, post-integration-test, verify, install, deploy]
[09:53:15][com.su:employee] [main] DEBUG org.apache.maven.lifecycle.DefaultLifecycles - Lifecycle clean -> [pre-clean, clean, post-clean]
[09:53:15][com.su:employee] [main] DEBUG org.apache.maven.lifecycle.DefaultLifecycles - Lifecycle site -> [pre-site, site, post-site, site-deploy]
[09:53:15][com.su:employee] [main] DEBUG org.apache.maven.lifecycle.internal.LifecycleDebugLogger - === PROJECT BUILD PLAN ================================================
[09:53:15][com.su:employee] [main] DEBUG org.apache.maven.lifecycle.internal.LifecycleDebugLogger - Project:       com.su:employee:1.0-SNAPSHOT
[09:53:15][com.su:employee] [main] DEBUG org.apache.maven.lifecycle.internal.LifecycleDebugLogger - Dependencies (collect): []
[09:53:15][com.su:employee] [main] DEBUG org.apache.maven.lifecycle.internal.LifecycleDebugLogger - Dependencies (resolve): [compile, runtime, test]
[09:53:15][com.su:employee] [main] DEBUG org.apache.maven.lifecycle.internal.LifecycleDebugLogger - Repositories (dependencies): [central (http://repo.maven.apache.org/maven2, releases)]
[09:53:15][com.su:employee] [main] DEBUG org.apache.maven.lifecycle.internal.LifecycleDebugLogger - Repositories (plugins)     : [central (http://repo.maven.apache.org/maven2, releases)]
[09:53:15][com.su:employee] [main] DEBUG org.apache.maven.lifecycle.internal.LifecycleDebugLogger - -----------------------------------------------------------------------
[09:53:15][com.su:employee] [main] DEBUG org.apache.maven.lifecycle.internal.LifecycleDebugLogger - Goal:          org.apache.maven.plugins:maven-resources-plugin:2.6:resources (default-resources)
[09:53:15][com.su:employee] [main] DEBUG org.apache.maven.lifecycle.internal.LifecycleDebugLogger - Style:         Regular
[09:53:15][com.su:employee] [main] DEBUG org.apache.maven.lifecycle.internal.LifecycleDebugLogger - Configuration: <?xml version="1.0" encoding="UTF-8"?>
[09:53:15][com.su:employee] <configuration>
[09:53:15][com.su:employee]   <buildFilters default-value="${project.build.filters}"/>
[09:53:15][com.su:employee]   <encoding default-value="${project.build.sourceEncoding}">${encoding}</encoding>
[09:53:15][com.su:employee]   <escapeString>${maven.resources.escapeString}</escapeString>
[09:53:15][com.su:employee]   <escapeWindowsPaths default-value="true">${maven.resources.escapeWindowsPaths}</escapeWindowsPaths>
[09:53:15][com.su:employee]   <includeEmptyDirs default-value="false">${maven.resources.includeEmptyDirs}</includeEmptyDirs>
[09:53:15][com.su:employee]   <outputDirectory default-value="${project.build.outputDirectory}"/>
[09:53:15][com.su:employee]   <overwrite default-value="false">${maven.resources.overwrite}</overwrite>
[09:53:15][com.su:employee]   <project default-value="${project}"/>
[09:53:15][com.su:employee]   <resources default-value="${project.resources}"/>
[09:53:15][com.su:employee]   <session default-value="${session}"/>
[09:53:15][com.su:employee]   <supportMultiLineFiltering default-value="false">${maven.resources.supportMultiLineFiltering}</supportMultiLineFiltering>
[09:53:15][com.su:employee]   <useBuildFilters default-value="true"/>
[09:53:15][com.su:employee]   <useDefaultDelimiters default-value="true"/>
[09:53:15][com.su:employee] </configuration>
[09:53:15][com.su:employee] [main] DEBUG org.apache.maven.lifecycle.internal.LifecycleDebugLogger - -----------------------------------------------------------------------
[09:53:15][com.su:employee] [main] DEBUG org.apache.maven.lifecycle.internal.LifecycleDebugLogger - Goal:          org.apache.maven.plugins:maven-compiler-plugin:2.5.1:compile (default-compile)
[09:53:15][com.su:employee] [main] DEBUG org.apache.maven.lifecycle.internal.LifecycleDebugLogger - Style:         Regular
[09:53:15][com.su:employee] [main] DEBUG org.apache.maven.lifecycle.internal.LifecycleDebugLogger - Configuration: <?xml version="1.0" encoding="UTF-8"?>
[09:53:15][com.su:employee] <configuration>
[09:53:15][com.su:employee]   <basedir default-value="${basedir}"/>
[09:53:15][com.su:employee]   <buildDirectory default-value="${project.build.directory}"/>
[09:53:15][com.su:employee]   <classpathElements default-value="${project.compileClasspathElements}"/>
[09:53:15][com.su:employee]   <compileSourceRoots default-value="${project.compileSourceRoots}"/>
[09:53:15][com.su:employee]   <compilerId default-value="javac">${maven.compiler.compilerId}</compilerId>
[09:53:15][com.su:employee]   <compilerReuseStrategy default-value="${reuseCreated}">${maven.compiler.compilerReuseStrategy}</compilerReuseStrategy>
[09:53:15][com.su:employee]   <compilerVersion>${maven.compiler.compilerVersion}</compilerVersion>
[09:53:15][com.su:employee]   <debug default-value="true">${maven.compiler.debug}</debug>
[09:53:15][com.su:employee]   <debuglevel>${maven.compiler.debuglevel}</debuglevel>
[09:53:15][com.su:employee]   <encoding default-value="${project.build.sourceEncoding}">${encoding}</encoding>
[09:53:15][com.su:employee]   <executable>${maven.compiler.executable}</executable>
[09:53:15][com.su:employee]   <failOnError default-value="true">${maven.compiler.failOnError}</failOnError>
[09:53:15][com.su:employee]   <fork default-value="false">${maven.compiler.fork}</fork>
[09:53:15][com.su:employee]   <generatedSourcesDirectory default-value="${project.build.directory}/generated-sources/annotations"/>
[09:53:15][com.su:employee]   <maxmem>${maven.compiler.maxmem}</maxmem>
[09:53:15][com.su:employee]   <meminitial>${maven.compiler.meminitial}</meminitial>
[09:53:15][com.su:employee]   <optimize default-value="false">${maven.compiler.optimize}</optimize>
[09:53:15][com.su:employee]   <outputDirectory default-value="${project.build.outputDirectory}"/>
[09:53:15][com.su:employee]   <outputFileName>${project.build.finalName}</outputFileName>
[09:53:15][com.su:employee]   <projectArtifact default-value="${project.artifact}"/>
[09:53:15][com.su:employee]   <session default-value="${session}"/>
[09:53:15][com.su:employee]   <showDeprecation default-value="false">${maven.compiler.showDeprecation}</showDeprecation>
[09:53:15][com.su:employee]   <showWarnings default-value="false">${maven.compiler.showWarnings}</showWarnings>
[09:53:15][com.su:employee]   <skipMultiThreadWarning default-value="${false}">${maven.compiler.skipMultiThreadWarning}</skipMultiThreadWarning>
[09:53:15][com.su:employee]   <source default-value="1.5">${maven.compiler.source}</source>
[09:53:15][com.su:employee]   <staleMillis default-value="0">${lastModGranularityMs}</staleMillis>
[09:53:15][com.su:employee]   <target default-value="1.5">${maven.compiler.target}</target>
[09:53:15][com.su:employee]   <verbose default-value="false">${maven.compiler.verbose}</verbose>
[09:53:15][com.su:employee] </configuration>
[09:53:15][com.su:employee] [main] DEBUG org.apache.maven.lifecycle.internal.LifecycleDebugLogger - -----------------------------------------------------------------------
[09:53:15][com.su:employee] [main] DEBUG org.apache.maven.lifecycle.internal.LifecycleDebugLogger - Goal:          org.apache.maven.plugins:maven-resources-plugin:2.6:testResources (default-testResources)
[09:53:15][com.su:employee] [main] DEBUG org.apache.maven.lifecycle.internal.LifecycleDebugLogger - Style:         Regular
[09:53:15][com.su:employee] [main] DEBUG org.apache.maven.lifecycle.internal.LifecycleDebugLogger - Configuration: <?xml version="1.0" encoding="UTF-8"?>
[09:53:15][com.su:employee] <configuration>
[09:53:15][com.su:employee]   <buildFilters default-value="${project.build.filters}"/>
[09:53:15][com.su:employee]   <encoding default-value="${project.build.sourceEncoding}">${encoding}</encoding>
[09:53:15][com.su:employee]   <escapeString>${maven.resources.escapeString}</escapeString>
[09:53:15][com.su:employee]   <escapeWindowsPaths default-value="true">${maven.resources.escapeWindowsPaths}</escapeWindowsPaths>
[09:53:15][com.su:employee]   <includeEmptyDirs default-value="false">${maven.resources.includeEmptyDirs}</includeEmptyDirs>
[09:53:15][com.su:employee]   <outputDirectory default-value="${project.build.testOutputDirectory}"/>
[09:53:15][com.su:employee]   <overwrite default-value="false">${maven.resources.overwrite}</overwrite>
[09:53:15][com.su:employee]   <project default-value="${project}"/>
[09:53:15][com.su:employee]   <resources default-value="${project.testResources}"/>
[09:53:15][com.su:employee]   <session default-value="${session}"/>
[09:53:15][com.su:employee]   <skip>${maven.test.skip}</skip>
[09:53:15][com.su:employee]   <supportMultiLineFiltering default-value="false">${maven.resources.supportMultiLineFiltering}</supportMultiLineFiltering>
[09:53:15][com.su:employee]   <useBuildFilters default-value="true"/>
[09:53:15][com.su:employee]   <useDefaultDelimiters default-value="true"/>
[09:53:15][com.su:employee] </configuration>
[09:53:15][com.su:employee] [main] DEBUG org.apache.maven.lifecycle.internal.LifecycleDebugLogger - -----------------------------------------------------------------------
[09:53:15][com.su:employee] [main] DEBUG org.apache.maven.lifecycle.internal.LifecycleDebugLogger - Goal:          org.apache.maven.plugins:maven-compiler-plugin:2.5.1:testCompile (default-testCompile)
[09:53:15][com.su:employee] [main] DEBUG org.apache.maven.lifecycle.internal.LifecycleDebugLogger - Style:         Regular
[09:53:15][com.su:employee] [main] DEBUG org.apache.maven.lifecycle.internal.LifecycleDebugLogger - Configuration: <?xml version="1.0" encoding="UTF-8"?>
[09:53:15][com.su:employee] <configuration>
[09:53:15][com.su:employee]   <basedir default-value="${basedir}"/>
[09:53:15][com.su:employee]   <buildDirectory default-value="${project.build.directory}"/>
[09:53:15][com.su:employee]   <classpathElements default-value="${project.testClasspathElements}"/>
[09:53:15][com.su:employee]   <compileSourceRoots default-value="${project.testCompileSourceRoots}"/>
[09:53:15][com.su:employee]   <compilerId default-value="javac">${maven.compiler.compilerId}</compilerId>
[09:53:15][com.su:employee]   <compilerReuseStrategy default-value="${reuseCreated}">${maven.compiler.compilerReuseStrategy}</compilerReuseStrategy>
[09:53:15][com.su:employee]   <compilerVersion>${maven.compiler.compilerVersion}</compilerVersion>
[09:53:15][com.su:employee]   <debug default-value="true">${maven.compiler.debug}</debug>
[09:53:15][com.su:employee]   <debuglevel>${maven.compiler.debuglevel}</debuglevel>
[09:53:15][com.su:employee]   <encoding default-value="${project.build.sourceEncoding}">${encoding}</encoding>
[09:53:15][com.su:employee]   <executable>${maven.compiler.executable}</executable>
[09:53:15][com.su:employee]   <failOnError default-value="true">${maven.compiler.failOnError}</failOnError>
[09:53:15][com.su:employee]   <fork default-value="false">${maven.compiler.fork}</fork>
[09:53:15][com.su:employee]   <generatedTestSourcesDirectory default-value="${project.build.directory}/generated-test-sources/test-annotations"/>
[09:53:15][com.su:employee]   <maxmem>${maven.compiler.maxmem}</maxmem>
[09:53:15][com.su:employee]   <meminitial>${maven.compiler.meminitial}</meminitial>
[09:53:15][com.su:employee]   <optimize default-value="false">${maven.compiler.optimize}</optimize>
[09:53:15][com.su:employee]   <outputDirectory default-value="${project.build.testOutputDirectory}"/>
[09:53:15][com.su:employee]   <outputFileName>${project.build.finalName}</outputFileName>
[09:53:15][com.su:employee]   <session default-value="${session}"/>
[09:53:15][com.su:employee]   <showDeprecation default-value="false">${maven.compiler.showDeprecation}</showDeprecation>
[09:53:15][com.su:employee]   <showWarnings default-value="false">${maven.compiler.showWarnings}</showWarnings>
[09:53:15][com.su:employee]   <skip>${maven.test.skip}</skip>
[09:53:15][com.su:employee]   <skipMultiThreadWarning default-value="${false}">${maven.compiler.skipMultiThreadWarning}</skipMultiThreadWarning>
[09:53:15][com.su:employee]   <source default-value="1.5">${maven.compiler.source}</source>
[09:53:15][com.su:employee]   <staleMillis default-value="0">${lastModGranularityMs}</staleMillis>
[09:53:15][com.su:employee]   <target default-value="1.5">${maven.compiler.target}</target>
[09:53:15][com.su:employee]   <testSource>${maven.compiler.testSource}</testSource>
[09:53:15][com.su:employee]   <testTarget>${maven.compiler.testTarget}</testTarget>
[09:53:15][com.su:employee]   <verbose default-value="false">${maven.compiler.verbose}</verbose>
[09:53:15][com.su:employee] </configuration>
[09:53:15][com.su:employee] [main] DEBUG org.apache.maven.lifecycle.internal.LifecycleDebugLogger - -----------------------------------------------------------------------
[09:53:15][com.su:employee] [main] DEBUG org.apache.maven.lifecycle.internal.LifecycleDebugLogger - Goal:          org.apache.maven.plugins:maven-surefire-plugin:2.12.4:test (default-test)
[09:53:15][com.su:employee] [main] DEBUG org.apache.maven.lifecycle.internal.LifecycleDebugLogger - Style:         Regular
[09:53:15][com.su:employee] [main] DEBUG org.apache.maven.lifecycle.internal.LifecycleDebugLogger - Configuration: <?xml version="1.0" encoding="UTF-8"?>
[09:53:15][com.su:employee] <configuration>
[09:53:15][com.su:employee]   <argLine>${argLine}</argLine>
[09:53:15][com.su:employee]   <basedir default-value="${basedir}"/>
[09:53:15][com.su:employee]   <childDelegation default-value="false">${childDelegation}</childDelegation>
[09:53:15][com.su:employee]   <classesDirectory default-value="${project.build.outputDirectory}"/>
[09:53:15][com.su:employee]   <debugForkedProcess>${maven.surefire.debug}</debugForkedProcess>
[09:53:15][com.su:employee]   <disableXmlReport default-value="false">${disableXmlReport}</disableXmlReport>
[09:53:15][com.su:employee]   <enableAssertions default-value="true">${enableAssertions}</enableAssertions>
[09:53:15][com.su:employee]   <excludedGroups>${excludedGroups}</excludedGroups>
[09:53:15][com.su:employee]   <failIfNoSpecifiedTests>${surefire.failIfNoSpecifiedTests}</failIfNoSpecifiedTests>
[09:53:15][com.su:employee]   <failIfNoTests>${failIfNoTests}</failIfNoTests>
[09:53:15][com.su:employee]   <forkMode default-value="once">${forkMode}</forkMode>
[09:53:15][com.su:employee]   <forkedProcessTimeoutInSeconds>${surefire.timeout}</forkedProcessTimeoutInSeconds>
[09:53:15][com.su:employee]   <groups>${groups}</groups>
[09:53:15][com.su:employee]   <junitArtifactName default-value="junit:junit">${junitArtifactName}</junitArtifactName>
[09:53:15][com.su:employee]   <jvm>${jvm}</jvm>
[09:53:15][com.su:employee]   <localRepository default-value="${localRepository}"/>
[09:53:15][com.su:employee]   <objectFactory>${objectFactory}</objectFactory>
[09:53:15][com.su:employee]   <parallel>${parallel}</parallel>
[09:53:15][com.su:employee]   <parallelMavenExecution default-value="${session.parallel}"/>
[09:53:15][com.su:employee]   <perCoreThreadCount default-value="true">${perCoreThreadCount}</perCoreThreadCount>
[09:53:15][com.su:employee]   <pluginArtifactMap>${plugin.artifactMap}</pluginArtifactMap>
[09:53:15][com.su:employee]   <pluginDescriptor default-value="${plugin}"/>
[09:53:15][com.su:employee]   <printSummary default-value="true">${surefire.printSummary}</printSummary>
[09:53:15][com.su:employee]   <projectArtifactMap>${project.artifactMap}</projectArtifactMap>
[09:53:15][com.su:employee]   <redirectTestOutputToFile default-value="false">${maven.test.redirectTestOutputToFile}</redirectTestOutputToFile>
[09:53:15][com.su:employee]   <remoteRepositories default-value="${project.pluginArtifactRepositories}"/>
[09:53:15][com.su:employee]   <reportFormat default-value="brief">${surefire.reportFormat}</reportFormat>
[09:53:15][com.su:employee]   <reportNameSuffix default-value="">${surefire.reportNameSuffix}</reportNameSuffix>
[09:53:15][com.su:employee]   <reportsDirectory default-value="${project.build.directory}/surefire-reports"/>
[09:53:15][com.su:employee]   <runOrder default-value="filesystem"/>
[09:53:15][com.su:employee]   <skip default-value="false">${maven.test.skip}</skip>
[09:53:15][com.su:employee]   <skipExec>${maven.test.skip.exec}</skipExec>
[09:53:15][com.su:employee]   <skipTests default-value="false">${skipTests}</skipTests>
[09:53:15][com.su:employee]   <test>${test}</test>
[09:53:15][com.su:employee]   <testClassesDirectory default-value="${project.build.testOutputDirectory}"/>
[09:53:15][com.su:employee]   <testFailureIgnore default-value="false">${maven.test.failure.ignore}</testFailureIgnore>
[09:53:15][com.su:employee]   <testNGArtifactName default-value="org.testng:testng">${testNGArtifactName}</testNGArtifactName>
[09:53:15][com.su:employee]   <testSourceDirectory default-value="${project.build.testSourceDirectory}"/>
[09:53:15][com.su:employee]   <threadCount>${threadCount}</threadCount>
[09:53:15][com.su:employee]   <trimStackTrace default-value="true">${trimStackTrace}</trimStackTrace>
[09:53:15][com.su:employee]   <useFile default-value="true">${surefire.useFile}</useFile>
[09:53:15][com.su:employee]   <useManifestOnlyJar default-value="true">${surefire.useManifestOnlyJar}</useManifestOnlyJar>
[09:53:15][com.su:employee]   <useSystemClassLoader default-value="true">${surefire.useSystemClassLoader}</useSystemClassLoader>
[09:53:15][com.su:employee]   <useUnlimitedThreads default-value="false">${useUnlimitedThreads}</useUnlimitedThreads>
[09:53:15][com.su:employee]   <workingDirectory>${basedir}</workingDirectory>
[09:53:15][com.su:employee]   <project default-value="${project}"/>
[09:53:15][com.su:employee]   <session default-value="${session}"/>
[09:53:15][com.su:employee] </configuration>
[09:53:15][com.su:employee] [main] DEBUG org.apache.maven.lifecycle.internal.LifecycleDebugLogger - -----------------------------------------------------------------------
[09:53:15][com.su:employee] [main] DEBUG org.apache.maven.lifecycle.internal.LifecycleDebugLogger - Goal:          org.apache.maven.plugins:maven-jar-plugin:2.4:jar (default-jar)
[09:53:15][com.su:employee] [main] DEBUG org.apache.maven.lifecycle.internal.LifecycleDebugLogger - Style:         Regular
[09:53:15][com.su:employee] [main] DEBUG org.apache.maven.lifecycle.internal.LifecycleDebugLogger - Configuration: <?xml version="1.0" encoding="UTF-8"?>
[09:53:15][com.su:employee] <configuration>
[09:53:15][com.su:employee]   <classesDirectory default-value="${project.build.outputDirectory}"/>
[09:53:15][com.su:employee]   <defaultManifestFile default-value="${project.build.outputDirectory}/META-INF/MANIFEST.MF"/>
[09:53:15][com.su:employee]   <finalName default-value="${project.build.finalName}">${jar.finalName}</finalName>
[09:53:15][com.su:employee]   <forceCreation default-value="false">${jar.forceCreation}</forceCreation>
[09:53:15][com.su:employee]   <outputDirectory default-value="${project.build.directory}"/>
[09:53:15][com.su:employee]   <project default-value="${project}"/>
[09:53:15][com.su:employee]   <session default-value="${session}"/>
[09:53:15][com.su:employee]   <skipIfEmpty default-value="false">${jar.skipIfEmpty}</skipIfEmpty>
[09:53:15][com.su:employee]   <useDefaultManifestFile default-value="false">${jar.useDefaultManifestFile}</useDefaultManifestFile>
[09:53:15][com.su:employee] </configuration>
[09:53:15][com.su:employee] [main] DEBUG org.apache.maven.lifecycle.internal.LifecycleDebugLogger - -----------------------------------------------------------------------
[09:53:15][com.su:employee] [main] DEBUG org.apache.maven.lifecycle.internal.LifecycleDebugLogger - Goal:          org.apache.maven.plugins:maven-install-plugin:2.4:install (default-install)
[09:53:15][com.su:employee] [main] DEBUG org.apache.maven.lifecycle.internal.LifecycleDebugLogger - Style:         Regular
[09:53:15][com.su:employee] [main] DEBUG org.apache.maven.lifecycle.internal.LifecycleDebugLogger - Configuration: <?xml version="1.0" encoding="UTF-8"?>
[09:53:15][com.su:employee] <configuration>
[09:53:15][com.su:employee]   <artifact default-value="${project.artifact}"/>
[09:53:15][com.su:employee]   <attachedArtifacts default-value="${project.attachedArtifacts}"/>
[09:53:15][com.su:employee]   <createChecksum default-value="false">${createChecksum}</createChecksum>
[09:53:15][com.su:employee]   <localRepository>${localRepository}</localRepository>
[09:53:15][com.su:employee]   <packaging default-value="${project.packaging}"/>
[09:53:15][com.su:employee]   <pomFile default-value="${project.file}"/>
[09:53:15][com.su:employee]   <skip default-value="false">${maven.install.skip}</skip>
[09:53:15][com.su:employee]   <updateReleaseInfo default-value="false">${updateReleaseInfo}</updateReleaseInfo>
[09:53:15][com.su:employee] </configuration>
[09:53:15][com.su:employee] [main] DEBUG org.apache.maven.lifecycle.internal.LifecycleDebugLogger - -----------------------------------------------------------------------
[09:53:15][com.su:employee] [main] DEBUG org.apache.maven.lifecycle.internal.LifecycleDebugLogger - Goal:          org.apache.maven.plugins:maven-deploy-plugin:2.7:deploy (default-deploy)
[09:53:15][com.su:employee] [main] DEBUG org.apache.maven.lifecycle.internal.LifecycleDebugLogger - Style:         Regular
[09:53:15][com.su:employee] [main] DEBUG org.apache.maven.lifecycle.internal.LifecycleDebugLogger - Configuration: <?xml version="1.0" encoding="UTF-8"?>
[09:53:15][com.su:employee] <configuration>
[09:53:15][com.su:employee]   <altDeploymentRepository>${altDeploymentRepository}</altDeploymentRepository>
[09:53:15][com.su:employee]   <artifact default-value="${project.artifact}"/>
[09:53:15][com.su:employee]   <attachedArtifacts default-value="${project.attachedArtifacts}"/>
[09:53:15][com.su:employee]   <localRepository default-value="${localRepository}"/>
[09:53:15][com.su:employee]   <offline default-value="${settings.offline}"/>
[09:53:15][com.su:employee]   <packaging default-value="${project.packaging}"/>
[09:53:15][com.su:employee]   <pomFile default-value="${project.file}"/>
[09:53:15][com.su:employee]   <project default-value="${project}"/>
[09:53:15][com.su:employee]   <retryFailedDeploymentCount default-value="1">${retryFailedDeploymentCount}</retryFailedDeploymentCount>
[09:53:15][com.su:employee]   <skip default-value="false">${maven.deploy.skip}</skip>
[09:53:15][com.su:employee]   <updateReleaseInfo default-value="false">${updateReleaseInfo}</updateReleaseInfo>
[09:53:15][com.su:employee] </configuration>
[09:53:15][com.su:employee] [main] DEBUG org.apache.maven.lifecycle.internal.LifecycleDebugLogger - =======================================================================
[09:53:15][com.su:employee] Surefire report watcher
[09:53:15][com.su:employee] [main] DEBUG org.eclipse.aether.internal.impl.DefaultDependencyCollector - Dependency collection stats: {ConflictMarker.analyzeTime=1, ConflictMarker.markTime=0, ConflictMarker.nodeCount=27, ConflictIdSorter.graphTime=0, ConflictIdSorter.topsortTime=0, ConflictIdSorter.conflictIdCount=12, ConflictIdSorter.conflictIdCycleCount=0, ConflictResolver.totalTime=1, ConflictResolver.conflictItemCount=26, DefaultDependencyCollector.collectTime=73, DefaultDependencyCollector.transformTime=2}
[09:53:15][com.su:employee] [main] DEBUG org.apache.maven.project.DefaultProjectDependenciesResolver - com.su:employee:jar:1.0-SNAPSHOT
[09:53:15][com.su:employee] [main] DEBUG org.apache.maven.project.DefaultProjectDependenciesResolver -    junit:junit:jar:3.8.1:test
[09:53:15][com.su:employee] [main] DEBUG org.apache.maven.project.DefaultProjectDependenciesResolver -    org.springframework:spring-core:jar:3.0.5.RELEASE:compile
[09:53:15][com.su:employee] [main] DEBUG org.apache.maven.project.DefaultProjectDependenciesResolver -       org.springframework:spring-asm:jar:3.0.5.RELEASE:compile
[09:53:15][com.su:employee] [main] DEBUG org.apache.maven.project.DefaultProjectDependenciesResolver -       commons-logging:commons-logging:jar:1.1.1:compile
[09:53:15][com.su:employee] [main] DEBUG org.apache.maven.project.DefaultProjectDependenciesResolver -    org.springframework:spring-context:jar:3.0.5.RELEASE:compile
[09:53:15][com.su:employee] [main] DEBUG org.apache.maven.project.DefaultProjectDependenciesResolver -       org.springframework:spring-aop:jar:3.0.5.RELEASE:compile
[09:53:15][com.su:employee] [main] DEBUG org.apache.maven.project.DefaultProjectDependenciesResolver -          aopalliance:aopalliance:jar:1.0:compile
[09:53:15][com.su:employee] [main] DEBUG org.apache.maven.project.DefaultProjectDependenciesResolver -       org.springframework:spring-beans:jar:3.0.5.RELEASE:compile
[09:53:15][com.su:employee] [main] DEBUG org.apache.maven.project.DefaultProjectDependenciesResolver -       org.springframework:spring-expression:jar:3.0.5.RELEASE:compile
[09:53:15][com.su:employee] [main] DEBUG org.apache.maven.project.DefaultProjectDependenciesResolver -    postgresql:postgresql:jar:9.1-901.jdbc4:compile
[09:53:15][com.su:employee] [main] DEBUG org.apache.maven.project.DefaultProjectDependenciesResolver -    org.springframework:spring-jdbc:jar:3.0.5.RELEASE:compile
[09:53:15][com.su:employee] [main] DEBUG org.apache.maven.project.DefaultProjectDependenciesResolver -       org.springframework:spring-tx:jar:3.0.5.RELEASE:compile
[09:53:15][com.su:employee] [main] INFO org.apache.maven.cli.event.ExecutionEventLogger -
[09:53:15][com.su:employee] [main] INFO org.apache.maven.cli.event.ExecutionEventLogger - --- maven-resources-plugin:2.6:resources (default-resources) @ employee ---
[09:53:15][com.su:employee] [main] DEBUG org.eclipse.aether.internal.impl.DefaultDependencyCollector - Dependency collection stats: {ConflictMarker.analyzeTime=0, ConflictMarker.markTime=1, ConflictMarker.nodeCount=77, ConflictIdSorter.graphTime=0, ConflictIdSorter.topsortTime=0, ConflictIdSorter.conflictIdCount=26, ConflictIdSorter.conflictIdCycleCount=0, ConflictResolver.totalTime=27, ConflictResolver.conflictItemCount=74, DefaultDependencyCollector.collectTime=108, DefaultDependencyCollector.transformTime=28}
[09:53:15][com.su:employee] [main] DEBUG org.apache.maven.plugin.internal.DefaultPluginDependenciesResolver - org.apache.maven.plugins:maven-resources-plugin:jar:2.6:
[09:53:15][com.su:employee] [main] DEBUG org.apache.maven.plugin.internal.DefaultPluginDependenciesResolver -    org.apache.maven:maven-plugin-api:jar:2.0.6:compile
[09:53:15][com.su:employee] [main] DEBUG org.apache.maven.plugin.internal.DefaultPluginDependenciesResolver -    org.apache.maven:maven-project:jar:2.0.6:compile
[09:53:15][com.su:employee] [main] DEBUG org.apache.maven.plugin.internal.DefaultPluginDependenciesResolver -       org.apache.maven:maven-profile:jar:2.0.6:compile
[09:53:15][com.su:employee] [main] DEBUG org.apache.maven.plugin.internal.DefaultPluginDependenciesResolver -       org.apache.maven:maven-artifact-manager:jar:2.0.6:compile
[09:53:15][com.su:employee] [main] DEBUG org.apache.maven.plugin.internal.DefaultPluginDependenciesResolver -       org.apache.maven:maven-plugin-registry:jar:2.0.6:compile
[09:53:15][com.su:employee] [main] DEBUG org.apache.maven.plugin.internal.DefaultPluginDependenciesResolver -    org.apache.maven:maven-core:jar:2.0.6:compile
[09:53:15][com.su:employee] [main] DEBUG org.apache.maven.plugin.internal.DefaultPluginDependenciesResolver -       org.apache.maven:maven-plugin-parameter-documenter:jar:2.0.6:compile
[09:53:15][com.su:employee] [main] DEBUG org.apache.maven.plugin.internal.DefaultPluginDependenciesResolver -       org.apache.maven.reporting:maven-reporting-api:jar:2.0.6:compile
[09:53:15][com.su:employee] [main] DEBUG org.apache.maven.plugin.internal.DefaultPluginDependenciesResolver -          org.apache.maven.doxia:doxia-sink-api:jar:1.0-alpha-7:compile
[09:53:15][com.su:employee] [main] DEBUG org.apache.maven.plugin.internal.DefaultPluginDependenciesResolver -       org.apache.maven:maven-repository-metadata:jar:2.0.6:compile
[09:53:15][com.su:employee] [main] DEBUG org.apache.maven.plugin.internal.DefaultPluginDependenciesResolver -       org.apache.maven:maven-error-diagnostics:jar:2.0.6:compile
[09:53:15][com.su:employee] [main] DEBUG org.apache.maven.plugin.internal.DefaultPluginDependenciesResolver -       commons-cli:commons-cli:jar:1.0:compile
[09:53:15][com.su:employee] [main] DEBUG org.apache.maven.plugin.internal.DefaultPluginDependenciesResolver -       org.apache.maven:maven-plugin-descriptor:jar:2.0.6:compile
[09:53:15][com.su:employee] [main] DEBUG org.apache.maven.plugin.internal.DefaultPluginDependenciesResolver -       org.codehaus.plexus:plexus-interactivity-api:jar:1.0-alpha-4:compile
[09:53:15][com.su:employee] [main] DEBUG org.apache.maven.plugin.internal.DefaultPluginDependenciesResolver -       classworlds:classworlds:jar:1.1:compile
[09:53:15][com.su:employee] [main] DEBUG org.apache.maven.plugin.internal.DefaultPluginDependenciesResolver -    org.apache.maven:maven-artifact:jar:2.0.6:compile
[09:53:15][com.su:employee] [main] DEBUG org.apache.maven.plugin.internal.DefaultPluginDependenciesResolver -    org.apache.maven:maven-settings:jar:2.0.6:compile
[09:53:15][com.su:employee] [main] DEBUG org.apache.maven.plugin.internal.DefaultPluginDependenciesResolver -    org.apache.maven:maven-model:jar:2.0.6:compile
[09:53:15][com.su:employee] [main] DEBUG org.apache.maven.plugin.internal.DefaultPluginDependenciesResolver -    org.apache.maven:maven-monitor:jar:2.0.6:compile
[09:53:15][com.su:employee] [main] DEBUG org.apache.maven.plugin.internal.DefaultPluginDependenciesResolver -    org.codehaus.plexus:plexus-container-default:jar:1.0-alpha-9-stable-1:compile
[09:53:15][com.su:employee] [main] DEBUG org.apache.maven.plugin.internal.DefaultPluginDependenciesResolver -       junit:junit:jar:3.8.1:compile
[09:53:15][com.su:employee] [main] DEBUG org.apache.maven.plugin.internal.DefaultPluginDependenciesResolver -    org.codehaus.plexus:plexus-utils:jar:2.0.5:compile
[09:53:15][com.su:employee] [main] DEBUG org.apache.maven.plugin.internal.DefaultPluginDependenciesResolver -    org.apache.maven.shared:maven-filtering:jar:1.1:compile
[09:53:15][com.su:employee] [main] DEBUG org.apache.maven.plugin.internal.DefaultPluginDependenciesResolver -       org.sonatype.plexus:plexus-build-api:jar:0.0.4:compile
[09:53:15][com.su:employee] [main] DEBUG org.apache.maven.plugin.internal.DefaultPluginDependenciesResolver -    org.codehaus.plexus:plexus-interpolation:jar:1.13:compile
[09:53:15][com.su:employee] [main] DEBUG org.apache.maven.classrealm.DefaultClassRealmManager - Created new class realm plugin>org.apache.maven.plugins:maven-resources-plugin:2.6
[09:53:15][com.su:employee] [main] DEBUG org.apache.maven.classrealm.DefaultClassRealmManager - Importing foreign packages into class realm plugin>org.apache.maven.plugins:maven-resources-plugin:2.6
[09:53:15][com.su:employee] [main] DEBUG org.apache.maven.classrealm.DefaultClassRealmManager -   Imported:  < maven.api
[09:53:15][com.su:employee] [main] DEBUG org.apache.maven.classrealm.DefaultClassRealmManager - Populating class realm plugin>org.apache.maven.plugins:maven-resources-plugin:2.6
[09:53:15][com.su:employee] [main] DEBUG org.apache.maven.classrealm.DefaultClassRealmManager -   Included: org.apache.maven.plugins:maven-resources-plugin:jar:2.6
[09:53:15][com.su:employee] [main] DEBUG org.apache.maven.classrealm.DefaultClassRealmManager -   Included: org.apache.maven.reporting:maven-reporting-api:jar:2.0.6
[09:53:15][com.su:employee] [main] DEBUG org.apache.maven.classrealm.DefaultClassRealmManager -   Included: org.apache.maven.doxia:doxia-sink-api:jar:1.0-alpha-7
[09:53:15][com.su:employee] [main] DEBUG org.apache.maven.classrealm.DefaultClassRealmManager -   Included: commons-cli:commons-cli:jar:1.0
[09:53:15][com.su:employee] [main] DEBUG org.apache.maven.classrealm.DefaultClassRealmManager -   Included: org.codehaus.plexus:plexus-interactivity-api:jar:1.0-alpha-4
[09:53:15][com.su:employee] [main] DEBUG org.apache.maven.classrealm.DefaultClassRealmManager -   Included: junit:junit:jar:3.8.1
[09:53:15][com.su:employee] [main] DEBUG org.apache.maven.classrealm.DefaultClassRealmManager -   Included: org.codehaus.plexus:plexus-utils:jar:2.0.5
[09:53:15][com.su:employee] [main] DEBUG org.apache.maven.classrealm.DefaultClassRealmManager -   Included: org.apache.maven.shared:maven-filtering:jar:1.1
[09:53:15][com.su:employee] [main] DEBUG org.apache.maven.classrealm.DefaultClassRealmManager -   Included: org.sonatype.plexus:plexus-build-api:jar:0.0.4
[09:53:15][com.su:employee] [main] DEBUG org.apache.maven.classrealm.DefaultClassRealmManager -   Included: org.codehaus.plexus:plexus-interpolation:jar:1.13
[09:53:15][com.su:employee] [main] DEBUG org.apache.maven.classrealm.DefaultClassRealmManager -   Excluded: org.apache.maven:maven-plugin-api:jar:2.0.6
[09:53:15][com.su:employee] [main] DEBUG org.apache.maven.classrealm.DefaultClassRealmManager -   Excluded: org.apache.maven:maven-project:jar:2.0.6
[09:53:15][com.su:employee] [main] DEBUG org.apache.maven.classrealm.DefaultClassRealmManager -   Excluded: org.apache.maven:maven-profile:jar:2.0.6
[09:53:15][com.su:employee] [main] DEBUG org.apache.maven.classrealm.DefaultClassRealmManager -   Excluded: org.apache.maven:maven-artifact-manager:jar:2.0.6
[09:53:15][com.su:employee] [main] DEBUG org.apache.maven.classrealm.DefaultClassRealmManager -   Excluded: org.apache.maven:maven-plugin-registry:jar:2.0.6
[09:53:15][com.su:employee] [main] DEBUG org.apache.maven.classrealm.DefaultClassRealmManager -   Excluded: org.apache.maven:maven-core:jar:2.0.6
[09:53:15][com.su:employee] [main] DEBUG org.apache.maven.classrealm.DefaultClassRealmManager -   Excluded: org.apache.maven:maven-plugin-parameter-documenter:jar:2.0.6
[09:53:15][com.su:employee] [main] DEBUG org.apache.maven.classrealm.DefaultClassRealmManager -   Excluded: org.apache.maven:maven-repository-metadata:jar:2.0.6
[09:53:15][com.su:employee] [main] DEBUG org.apache.maven.classrealm.DefaultClassRealmManager -   Excluded: org.apache.maven:maven-error-diagnostics:jar:2.0.6
[09:53:15][com.su:employee] [main] DEBUG org.apache.maven.classrealm.DefaultClassRealmManager -   Excluded: org.apache.maven:maven-plugin-descriptor:jar:2.0.6
[09:53:15][com.su:employee] [main] DEBUG org.apache.maven.classrealm.DefaultClassRealmManager -   Excluded: classworlds:classworlds:jar:1.1
[09:53:15][com.su:employee] [main] DEBUG org.apache.maven.classrealm.DefaultClassRealmManager -   Excluded: org.apache.maven:maven-artifact:jar:2.0.6
[09:53:15][com.su:employee] [main] DEBUG org.apache.maven.classrealm.DefaultClassRealmManager -   Excluded: org.apache.maven:maven-settings:jar:2.0.6
[09:53:15][com.su:employee] [main] DEBUG org.apache.maven.classrealm.DefaultClassRealmManager -   Excluded: org.apache.maven:maven-model:jar:2.0.6
[09:53:15][com.su:employee] [main] DEBUG org.apache.maven.classrealm.DefaultClassRealmManager -   Excluded: org.apache.maven:maven-monitor:jar:2.0.6
[09:53:15][com.su:employee] [main] DEBUG org.apache.maven.classrealm.DefaultClassRealmManager -   Excluded: org.codehaus.plexus:plexus-container-default:jar:1.0-alpha-9-stable-1
[09:53:15][com.su:employee] [main] DEBUG org.apache.maven.plugin.internal.DefaultMavenPluginManager - Configuring mojo org.apache.maven.plugins:maven-resources-plugin:2.6:resources from plugin realm ClassRealm[plugin>org.apache.maven.plugins:maven-resources-plugin:2.6, parent: sun.misc.Launcher$AppClassLoader@1497b7b1]
[09:53:15][com.su:employee] [main] DEBUG org.apache.maven.plugin.internal.DefaultMavenPluginManager - Configuring mojo 'org.apache.maven.plugins:maven-resources-plugin:2.6:resources' with basic configurator -->
[09:53:15][com.su:employee] [main] DEBUG org.apache.maven.plugin.internal.DefaultMavenPluginManager -   (f) buildFilters = []
[09:53:15][com.su:employee] [main] DEBUG org.apache.maven.plugin.internal.DefaultMavenPluginManager -   (f) escapeWindowsPaths = true
[09:53:15][com.su:employee] [main] DEBUG org.apache.maven.plugin.internal.DefaultMavenPluginManager -   (s) includeEmptyDirs = false
[09:53:15][com.su:employee] [main] DEBUG org.apache.maven.plugin.internal.DefaultMavenPluginManager -   (s) outputDirectory = C:\TeamCity\buildAgent\work\473a7ed72e7b745e\employee\target\classes
[09:53:15][com.su:employee] [main] DEBUG org.apache.maven.plugin.internal.DefaultMavenPluginManager -   (s) overwrite = false
[09:53:15][com.su:employee] [main] DEBUG org.apache.maven.plugin.internal.DefaultMavenPluginManager -   (f) project = MavenProject: com.su:employee:1.0-SNAPSHOT @ C:\TeamCity\buildAgent\work\473a7ed72e7b745e\employee\pom.xml
[09:53:15][com.su:employee] [main] DEBUG org.apache.maven.plugin.internal.DefaultMavenPluginManager -   (s) resources = [Resource {targetPath: null, filtering: false, FileSet {directory: C:\TeamCity\buildAgent\work\473a7ed72e7b745e\employee\src\main\resources, PatternSet [includes: {}, excludes: {}]}}]
[09:53:15][com.su:employee] [main] DEBUG org.apache.maven.plugin.internal.DefaultMavenPluginManager -   (f) session = org.apache.maven.execution.MavenSession@40b27ffb
[09:53:15][com.su:employee] [main] DEBUG org.apache.maven.plugin.internal.DefaultMavenPluginManager -   (f) supportMultiLineFiltering = false
[09:53:15][com.su:employee] [main] DEBUG org.apache.maven.plugin.internal.DefaultMavenPluginManager -   (f) useBuildFilters = true
[09:53:15][com.su:employee] [main] DEBUG org.apache.maven.plugin.internal.DefaultMavenPluginManager -   (s) useDefaultDelimiters = true
[09:53:15][com.su:employee] [main] DEBUG org.apache.maven.plugin.internal.DefaultMavenPluginManager - -- end configuration --
[09:53:15][com.su:employee] [main] DEBUG org.apache.maven.shared.filtering.DefaultMavenFileFilter - properties used {file.encoding.pkg=sun.io, env.CONFIGSETROOT=C:\WINDOWS\ConfigSetRoot, java.home=C:\Program Files\Java\jdk1.7.0_45\jre, teamcity.projectName=MainProject, env.JDK_17=c:\program files\java\jdk1.7.0_45, classworlds.conf=C:\TeamCity\buildAgent\temp\buildTmp\teamcity.m2.conf, java.endorsed.dirs=C:\Program Files\Java\jdk1.7.0_45\jre\lib\endorsed, env.USERNAME=JACKBIGLAPTOP$, teamcity.configuration.properties.file=C:\TeamCity\buildAgent\temp\buildTmp\teamcity.config5756304132928804850.properties, sun.os.patch.level=, teamcity.version=8.0.5 (build 27692), java.vendor.url=http://java.oracle.com/, env.COMPUTERNAME=JACKBIGLAPTOP, env.=C:=c:\TeamCity\buildAgent\bin, env.TEAMCITY_PROCESS_PARENT_FLOW_ID=, build.vcs.number.MainProject_MainProject=5, java.version=1.7.0_45, com.jetbrains.maven.watcher.report.file=C:\TeamCity\buildAgent\temp\buildTmp\maven-build-info.xml, java.vendor.url.bug=http://bugreport.sun.com/bugreport/, env.USERPROFILE=C:\WINDOWS\system32\config\systemprofile, teamcity.build.tempDir=C:\TeamCity\buildAgent\temp\buildTmp, user.name=JACKBIGLAPTOP$, build.number=6, sun.io.unicode.encoding=UnicodeLittle, agent.ownPort=9090, sun.jnu.encoding=Cp1252, java.runtime.name=Java(TM) SE Runtime Environment, env.LOCALAPPDATA=C:\WINDOWS\system32\config\systemprofile\AppData\Local, env.COMMONPROGRAMW6432=C:\Program Files\Common Files, java.specification.name=Java Platform API Specification, teamcity.maven.watcher.home=C:\TeamCity\buildAgent\plugins\mavenPlugin\maven-watcher, user.timezone=America/New_York, user.script=, path.separator=;, postgresql.version=9.1-901.jdbc4, env.PROCESSOR_IDENTIFIER=Intel64 Family 6 Model 58 Stepping 9, GenuineIntel, file.encoding=Cp1252, sun.java.command=org.codehaus.plexus.classworlds.launcher.Launcher -f C:\TeamCity\buildAgent\work\473a7ed72e7b745e\pom.xml -B deploy -X -e, env.NUMBER_OF_PROCESSORS=4, env.APPDATA=C:\WINDOWS\system32\config\systemprofile\AppData\Roaming, env.WINDIR=C:\WINDOWS, env.WRAPPER_BITS=32, env.TEAMCITY_PROJECT_NAME=MainProject, java.io.tmpdir=C:\TeamCity\buildAgent\temp\buildTmp, user.language=en, line.separator=
[09:53:15][com.su:employee] , maven.repo.local=C:/.m2/repository, env.TEAMCITY_JRE=C:\Program Files\Java\jdk1.7.0_45, env.WRAPPER_FILE_SEPARATOR=\, env.COMMONPROGRAMFILES=C:\Program Files\Common Files, agent.name=JackBigLaptop, java.vm.info=mixed mode, sun.desktop=windows, java.vm.specification.name=Java Virtual Machine Specification, env.WRAPPER_OS=windows, teamcity.dotnet.nunitlauncher1.1=C:\TeamCity\buildAgent\plugins\dotnetPlugin\bin\JetBrains.BuildServer.NUnitLauncher1.1.exe, teamcity.dotnet.nunitaddin=C:\TeamCity\buildAgent\plugins\dotnetPlugin\bin\JetBrains.TeamCity.NUnitAddin-NUnit, teamcity.coverage.runner=IDEA, env.M2_HOME=c:\users\su\maven, env.PATHEXT=.COM;.EXE;.BAT;.CMD;.VBS;.VBE;.JS;.JSE;.WSF;.WSH;.MSC, teamcity.coverage.idea.excludePatterns=**/*Test.java, env.PSMODULEPATH=C:\WINDOWS\system32\WindowsPowerShell\v1.0\Modules\, env.TEAMCITY_PROCESS_FLOW_ID=297235474647310, java.awt.printerjob=sun.awt.windows.WPrinterJob, teamcity.agent.dotnet.agent_url=http://localhost:9090/RPC2, teamcity.buildConfName=MainProject, env.TEAMCITY_BUILD_PROPERTIES_FILE=C:\TeamCity\buildAgent\temp\buildTmp\teamcity.build1110773657545620537.properties, env.PUBLIC=C:\Users\Public, env.USERDOMAIN=WORKGROUP, env.BUILD_VCS_NUMBER=5, teamcity.coverage.idea.includePatterns=**/main/src/**/*.java, build.vcs.number.1=5, env.VISUALSVN_SERVER=C:\Program Files (x86)\VisualSVN Server\, env.PROCESSOR_LEVEL=6, env.PROGRAMFILES(X86)=C:\Program Files (x86), env.BUILD_NUMBER=6, os.name=Windows 8, java.specification.vendor=Oracle Corporation, env.TMP=C:\TeamCity\buildAgent\temp\buildTmp, java.vm.name=Java HotSpot(TM) 64-Bit Server VM, maven.surefire.debug='-javaagent:C:\TeamCity\buildAgent\plugins\coveragePlugin\coverage-agent.jar=C:\TeamCity\buildAgent\temp\buildTmp\coverage4048126807686829421args', teamcity.dotnet.platform=C:\TeamCity\buildAgent\plugins\dotnetPlugin\bin\JetBrains.TeamCity.PlatformProcessRunner.1.1.exe, env.OS=Windows_NT, java.library.path=C:\Program Files\Java\jdk1.7.0_45\bin;C:\WINDOWS\Sun\Java\bin;C:\WINDOWS\system32;C:\WINDOWS;c:\users\su\maven\bin;C:\Program Files\CollabNet\Subversion Client;C:\app\oracle\product\12.1.0\dbhome_1\bin;%MAVEN_HOME%\bin;c:\program files\java\jdk1.7.0_45\bin;C:\Program Files (x86)\Intel\iCLS Client\;C:\Program Files\Intel\iCLS Client\;C:\WINDOWS\system32;C:\WINDOWS;C:\WINDOWS\System32\Wbem;C:\WINDOWS\System32\WindowsPowerShell\v1.0\;C:\Program Files (x86)\Intel\OpenCL SDK\2.0\bin\x86;C:\Program Files (x86)\Intel\OpenCL SDK\2.0\bin\x64;C:\Program Files\Intel\Intel(R) Management Engine Components\DAL;C:\Program Files\Intel\Intel(R) Management Engine Components\IPT;C:\Program Files (x86)\Intel\Intel(R) Management Engine Components\DAL;C:\Program Files (x86)\Intel\Intel(R) Management Engine Components\IPT;C:\Program Files\Lenovo\Bluetooth Software\;C:\Program Files\Lenovo\Bluetooth Software\syswow64;C:\Program Files (x86)\VisualSVN Server\bin;;., env.PROGRAMW6432=C:\Program Files, env.PATH=c:\users\su\maven\bin;C:\Program Files\CollabNet\Subversion Client;C:\app\oracle\product\12.1.0\dbhome_1\bin;%MAVEN_HOME%\bin;c:\program files\java\jdk1.7.0_45\bin;C:\Program Files (x86)\Intel\iCLS Client\;C:\Program Files\Intel\iCLS Client\;C:\WINDOWS\system32;C:\WINDOWS;C:\WINDOWS\System32\Wbem;C:\WINDOWS\System32\WindowsPowerShell\v1.0\;C:\Program Files (x86)\Intel\OpenCL SDK\2.0\bin\x86;C:\Program Files (x86)\Intel\OpenCL SDK\2.0\bin\x64;C:\Program Files\Intel\Intel(R) Management Engine Components\DAL;C:\Program Files\Intel\Intel(R) Management Engine Components\IPT;C:\Program Files (x86)\Intel\Intel(R) Management Engine Components\DAL;C:\Program Files (x86)\Intel\Intel(R) Management Engine Components\IPT;C:\Program Files\Lenovo\Bluetooth Software\;C:\Program Files\Lenovo\Bluetooth Software\syswow64;C:\Program Files (x86)\VisualSVN Server\bin;, env.JDK_HOME=c:\program files\java\jdk1.7.0_45, java.class.version=51.0, env.TEAMCITY_CAPTURE_ENV=c:\TeamCity\jre\bin\java.exe -jar C:\TeamCity\buildAgent\plugins\environment-fetcher\bin\env-fetcher.jar, teamcity.build.checkoutDir=C:\TeamCity\buildAgent\work\473a7ed72e7b745e, teamcity.auth.userId=TeamCityBuildId=18, teamcity.build.properties.file=C:\TeamCity\buildAgent\temp\buildTmp\teamcity.build1110773657545620537.properties, env.SYSTEMROOT=C:\WINDOWS, spring.version=3.0.5.RELEASE, env.COMSPEC=C:\WINDOWS\system32\cmd.exe, teamcity.buildType.id=MainProject_MainProject, sun.boot.library.path=C:\Program Files\Java\jdk1.7.0_45\jre\bin, teamcity.dotnet.nunitlauncher=C:\TeamCity\buildAgent\plugins\dotnetPlugin\bin\JetBrains.BuildServer.NUnitLauncher.exe, env.SYSTEMDRIVE=C:, env.PROCESSOR_REVISION=3a09, sun.management.compiler=HotSpot 64-Bit Tiered Compilers, env.BUILD_VCS_NUMBER_MAINPROJECT_MAINPROJECT=5, java.awt.graphicsenv=sun.awt.Win32GraphicsEnvironment, user.variant=, env.JDK_17_X64=c:\program files\java\jdk1.7.0_45, env.JRE_HOME=c:\program files\java\jdk1.7.0_45, env.WRAPPER_PATH_SEPARATOR=;, build.vcs.number=5, env.PROGRAMFILES=C:\Program Files, java.vm.specification.version=1.7, teamcity.dotnet.nunitlauncher2.0.vsts=C:\TeamCity\buildAgent\plugins\dotnetPlugin\bin\JetBrains.BuildServer.NUnitLauncher2.0.VSTS.exe, env.PROGRAMDATA=C:\ProgramData, awt.toolkit=sun.awt.windows.WToolkit, sun.cpu.isalist=amd64, java.ext.dirs=C:\Program Files\Java\jdk1.7.0_45\jre\lib\ext;C:\WINDOWS\Sun\Java\lib\ext, os.version=6.2, user.home=C:\, java.vm.vendor=Oracle Corporation, env.JAVA_HOME=c:\program files\java\jdk1.7.0_45, teamcity.tests.recentlyFailedTests.file=C:\TeamCity\buildAgent\temp\buildTmp\testsToRunFirst3186172005812643486.txt, user.dir=C:\TeamCity\buildAgent\work\473a7ed72e7b745e, env.COMMONPROGRAMFILES(X86)=C:\Program Files (x86)\Common Files, env.FP_NO_HOST_CHECK=NO, teamcity.build.id=18, teamcity.build.changedFiles.file=C:\TeamCity\buildAgent\temp\buildTmp\changedFiles7271889642607539483.txt, sun.cpu.endian=little, teamcity.auth.password=d7lfdBOB5rdSN8R2s6zGy6TVM5tjurTp, agent.home.dir=C:\TeamCity\buildAgent, teamcity.runner.properties.file=C:\TeamCity\buildAgent\temp\buildTmp\teamcity.runner624609232819970536.properties, env.ALLUSERSPROFILE=C:\ProgramData, env.TMPDIR=C:\TeamCity\buildAgent\temp\buildTmp, env.TEAMCITY_VERSION=8.0.5 (build 27692), env.PROCESSOR_ARCHITECTURE=AMD64, teamcity.build.workingDir=C:\TeamCity\buildAgent\work\473a7ed72e7b745e, env.TEAMCITY_DATA_PATH=C:\ProgramData\JetBrains\TeamCity, java.vm.version=24.45-b08, java.class.path=c:\users\su\maven\boot\plexus-classworlds-2.5.1.jar;, org.slf4j.simpleLogger.defaultLogLevel=debug, os.arch=amd64, maven.build.version=Apache Maven 3.1.1 (0728685237757ffbf44136acec0402957f723d9a; 2013-09-17 11:22:22-0400), teamcity.agent.cpuBenchmark=540, sun.java.launcher=SUN_STANDARD, teamcity.dotnet.nunitlauncher2.0=C:\TeamCity\buildAgent\plugins\dotnetPlugin\bin\JetBrains.BuildServer.NUnitLauncher2.0.exe, java.vm.specification.vendor=Oracle Corporation, teamcity.agent.dotnet.build_id=18, file.separator=\, env.WRAPPER_ARCH=x86, java.runtime.version=1.7.0_45-b18, sun.boot.class.path=C:\Program Files\Java\jdk1.7.0_45\jre\lib\resources.jar;C:\Program Files\Java\jdk1.7.0_45\jre\lib\rt.jar;C:\Program Files\Java\jdk1.7.0_45\jre\lib\sunrsasign.jar;C:\Program Files\Java\jdk1.7.0_45\jre\lib\jsse.jar;C:\Program Files\Java\jdk1.7.0_45\jre\lib\jce.jar;C:\Program Files\Java\jdk1.7.0_45\jre\lib\charsets.jar;C:\Program Files\Java\jdk1.7.0_45\jre\lib\jfr.jar;C:\Program Files\Java\jdk1.7.0_45\jre\classes, maven.failsafe.debug='-javaagent:C:\TeamCity\buildAgent\plugins\coveragePlugin\coverage-agent.jar=C:\TeamCity\buildAgent\temp\buildTmp\coverage4048126807686829421args', maven.version=3.1.1, env.TEAMCITY_BUILDCONF_NAME=MainProject, env.TEMP=C:\TeamCity\buildAgent\temp\buildTmp, user.country=US, agent.work.dir=C:\TeamCity\buildAgent\work, maven.home=c:\users\su\maven, teamcity.coverage.idea.baseDir=C:\TeamCity\buildAgent\temp\buildTmp\idea6838037627955084418coverage, teamcity.dotnet.nunitlauncher.msbuild.task=C:\TeamCity\buildAgent\plugins\dotnetPlugin\bin\JetBrains.BuildServer.MSBuildLoggers.dll, java.vendor=Oracle Corporation, java.specification.version=1.7, sun.arch.data.model=64}
[09:53:15][com.su:employee] [main] WARN org.apache.maven.shared.filtering.DefaultMavenResourcesFiltering - Using platform encoding (Cp1252 actually) to copy filtered resources, i.e. build is platform dependent!
[09:53:15][com.su:employee] [main] DEBUG org.apache.maven.shared.filtering.DefaultMavenResourcesFiltering - resource with targetPath null
[09:53:15][com.su:employee] directory C:\TeamCity\buildAgent\work\473a7ed72e7b745e\employee\src\main\resources
[09:53:15][com.su:employee] excludes []
[09:53:15][com.su:employee] includes []
[09:53:15][com.su:employee] [main] DEBUG org.apache.maven.shared.filtering.DefaultMavenResourcesFiltering - ignoreDelta true
[09:53:15][com.su:employee] [main] INFO org.apache.maven.shared.filtering.DefaultMavenResourcesFiltering - Copying 4 resources
[09:53:15][com.su:employee] [main] DEBUG org.apache.maven.shared.filtering.DefaultMavenResourcesFiltering - file context has a filtered file extension
[09:53:15][com.su:employee] [main] DEBUG org.apache.maven.shared.filtering.DefaultMavenFileFilter - copy C:\TeamCity\buildAgent\work\473a7ed72e7b745e\employee\src\main\resources\context to C:\TeamCity\buildAgent\work\473a7ed72e7b745e\employee\target\classes\context
[09:53:15][com.su:employee] [main] DEBUG org.apache.maven.shared.filtering.DefaultMavenResourcesFiltering - file clientContext.xml has a filtered file extension
[09:53:15][com.su:employee] [main] DEBUG org.apache.maven.shared.filtering.DefaultMavenFileFilter - copy C:\TeamCity\buildAgent\work\473a7ed72e7b745e\employee\src\main\resources\spring\clientContext.xml to C:\TeamCity\buildAgent\work\473a7ed72e7b745e\employee\target\classes\spring\clientContext.xml
[09:53:15][com.su:employee] [main] DEBUG org.apache.maven.shared.filtering.DefaultMavenResourcesFiltering - file context.xml has a filtered file extension
[09:53:15][com.su:employee] [main] DEBUG org.apache.maven.shared.filtering.DefaultMavenFileFilter - copy C:\TeamCity\buildAgent\work\473a7ed72e7b745e\employee\src\main\resources\spring\context.xml to C:\TeamCity\buildAgent\work\473a7ed72e7b745e\employee\target\classes\spring\context.xml
[09:53:15][com.su:employee] [main] DEBUG org.apache.maven.shared.filtering.DefaultMavenResourcesFiltering - file serverContext.xml has a filtered file extension
[09:53:15][com.su:employee] [main] DEBUG org.apache.maven.shared.filtering.DefaultMavenFileFilter - copy C:\TeamCity\buildAgent\work\473a7ed72e7b745e\employee\src\main\resources\spring\serverContext.xml to C:\TeamCity\buildAgent\work\473a7ed72e7b745e\employee\target\classes\spring\serverContext.xml
[09:53:15][com.su:employee] [main] DEBUG org.apache.maven.plugin.resources.ResourcesMojo - no use filter components
[09:53:15][com.su:employee] [main] INFO org.apache.maven.cli.event.ExecutionEventLogger -
[09:53:15][com.su:employee] [main] INFO org.apache.maven.cli.event.ExecutionEventLogger - --- maven-compiler-plugin:2.5.1:compile (default-compile) @ employee ---
[09:53:15][com.su:employee] [main] DEBUG org.eclipse.aether.internal.impl.DefaultDependencyCollector - Dependency collection stats: {ConflictMarker.analyzeTime=1, ConflictMarker.markTime=0, ConflictMarker.nodeCount=106, ConflictIdSorter.graphTime=0, ConflictIdSorter.topsortTime=0, ConflictIdSorter.conflictIdCount=27, ConflictIdSorter.conflictIdCycleCount=0, ConflictResolver.totalTime=4, ConflictResolver.conflictItemCount=53, DefaultDependencyCollector.collectTime=174, DefaultDependencyCollector.transformTime=5}
[09:53:15][com.su:employee] [main] DEBUG org.apache.maven.plugin.internal.DefaultPluginDependenciesResolver - org.apache.maven.plugins:maven-compiler-plugin:jar:2.5.1:
[09:53:15][com.su:employee] [main] DEBUG org.apache.maven.plugin.internal.DefaultPluginDependenciesResolver -    org.apache.maven:maven-plugin-api:jar:2.0.9:compile
[09:53:15][com.su:employee] [main] DEBUG org.apache.maven.plugin.internal.DefaultPluginDependenciesResolver -    org.apache.maven:maven-artifact:jar:2.0.9:compile
[09:53:15][com.su:employee] [main] DEBUG org.apache.maven.plugin.internal.DefaultPluginDependenciesResolver -    org.apache.maven:maven-core:jar:2.0.9:compile
[09:53:15][com.su:employee] [main] DEBUG org.apache.maven.plugin.internal.DefaultPluginDependenciesResolver -       org.apache.maven:maven-settings:jar:2.0.9:compile
[09:53:15][com.su:employee] [main] DEBUG org.apache.maven.plugin.internal.DefaultPluginDependenciesResolver -       org.apache.maven:maven-plugin-parameter-documenter:jar:2.0.9:compile
[09:53:15][com.su:employee] [main] DEBUG org.apache.maven.plugin.internal.DefaultPluginDependenciesResolver -       org.apache.maven:maven-profile:jar:2.0.9:compile
[09:53:15][com.su:employee] [main] DEBUG org.apache.maven.plugin.internal.DefaultPluginDependenciesResolver -       org.apache.maven:maven-model:jar:2.0.9:compile
[09:53:15][com.su:employee] [main] DEBUG org.apache.maven.plugin.internal.DefaultPluginDependenciesResolver -       org.apache.maven:maven-repository-metadata:jar:2.0.9:compile
[09:53:15][com.su:employee] [main] DEBUG org.apache.maven.plugin.internal.DefaultPluginDependenciesResolver -       org.apache.maven:maven-error-diagnostics:jar:2.0.9:compile
[09:53:15][com.su:employee] [main] DEBUG org.apache.maven.plugin.internal.DefaultPluginDependenciesResolver -       org.apache.maven:maven-project:jar:2.0.9:compile
[09:53:15][com.su:employee] [main] DEBUG org.apache.maven.plugin.internal.DefaultPluginDependenciesResolver -          org.apache.maven:maven-plugin-registry:jar:2.0.9:compile
[09:53:15][com.su:employee] [main] DEBUG org.apache.maven.plugin.internal.DefaultPluginDependenciesResolver -       org.apache.maven:maven-plugin-descriptor:jar:2.0.9:compile
[09:53:15][com.su:employee] [main] DEBUG org.apache.maven.plugin.internal.DefaultPluginDependenciesResolver -       org.apache.maven:maven-artifact-manager:jar:2.0.9:compile
[09:53:15][com.su:employee] [main] DEBUG org.apache.maven.plugin.internal.DefaultPluginDependenciesResolver -       org.apache.maven:maven-monitor:jar:2.0.9:compile
[09:53:15][com.su:employee] [main] DEBUG org.apache.maven.plugin.internal.DefaultPluginDependenciesResolver -    org.apache.maven:maven-toolchain:jar:1.0:compile
[09:53:15][com.su:employee] [main] DEBUG org.apache.maven.plugin.internal.DefaultPluginDependenciesResolver -    org.codehaus.plexus:plexus-utils:jar:3.0:compile
[09:53:15][com.su:employee] [main] DEBUG org.apache.maven.plugin.internal.DefaultPluginDependenciesResolver -    org.codehaus.plexus:plexus-compiler-api:jar:1.9.1:compile
[09:53:15][com.su:employee] [main] DEBUG org.apache.maven.plugin.internal.DefaultPluginDependenciesResolver -    org.codehaus.plexus:plexus-compiler-manager:jar:1.9.1:compile
[09:53:15][com.su:employee] [main] DEBUG org.apache.maven.plugin.internal.DefaultPluginDependenciesResolver -    org.codehaus.plexus:plexus-compiler-javac:jar:1.9.1:runtime
[09:53:15][com.su:employee] [main] DEBUG org.apache.maven.plugin.internal.DefaultPluginDependenciesResolver -    org.codehaus.plexus:plexus-container-default:jar:1.0-alpha-9-stable-1:compile
[09:53:15][com.su:employee] [main] DEBUG org.apache.maven.plugin.internal.DefaultPluginDependenciesResolver -       junit:junit:jar:3.8.1:compile
[09:53:15][com.su:employee] [main] DEBUG org.apache.maven.plugin.internal.DefaultPluginDependenciesResolver -       classworlds:classworlds:jar:1.1-alpha-2:compile
[09:53:15][com.su:employee] [main] DEBUG org.apache.maven.classrealm.DefaultClassRealmManager - Created new class realm plugin>org.apache.maven.plugins:maven-compiler-plugin:2.5.1
[09:53:15][com.su:employee] [main] DEBUG org.apache.maven.classrealm.DefaultClassRealmManager - Importing foreign packages into class realm plugin>org.apache.maven.plugins:maven-compiler-plugin:2.5.1
[09:53:15][com.su:employee] [main] DEBUG org.apache.maven.classrealm.DefaultClassRealmManager -   Imported:  < maven.api
[09:53:15][com.su:employee] [main] DEBUG org.apache.maven.classrealm.DefaultClassRealmManager - Populating class realm plugin>org.apache.maven.plugins:maven-compiler-plugin:2.5.1
[09:53:15][com.su:employee] [main] DEBUG org.apache.maven.classrealm.DefaultClassRealmManager -   Included: org.apache.maven.plugins:maven-compiler-plugin:jar:2.5.1
[09:53:15][com.su:employee] [main] DEBUG org.apache.maven.classrealm.DefaultClassRealmManager -   Included: org.codehaus.plexus:plexus-utils:jar:3.0
[09:53:15][com.su:employee] [main] DEBUG org.apache.maven.classrealm.DefaultClassRealmManager -   Included: org.codehaus.plexus:plexus-compiler-api:jar:1.9.1
[09:53:15][com.su:employee] [main] DEBUG org.apache.maven.classrealm.DefaultClassRealmManager -   Included: org.codehaus.plexus:plexus-compiler-manager:jar:1.9.1
[09:53:15][com.su:employee] [main] DEBUG org.apache.maven.classrealm.DefaultClassRealmManager -   Included: org.codehaus.plexus:plexus-compiler-javac:jar:1.9.1
[09:53:15][com.su:employee] [main] DEBUG org.apache.maven.classrealm.DefaultClassRealmManager -   Included: junit:junit:jar:3.8.1
[09:53:15][com.su:employee] [main] DEBUG org.apache.maven.classrealm.DefaultClassRealmManager -   Excluded: org.apache.maven:maven-plugin-api:jar:2.0.9
[09:53:15][com.su:employee] [main] DEBUG org.apache.maven.classrealm.DefaultClassRealmManager -   Excluded: org.apache.maven:maven-artifact:jar:2.0.9
[09:53:15][com.su:employee] [main] DEBUG org.apache.maven.classrealm.DefaultClassRealmManager -   Excluded: org.apache.maven:maven-core:jar:2.0.9
[09:53:15][com.su:employee] [main] DEBUG org.apache.maven.classrealm.DefaultClassRealmManager -   Excluded: org.apache.maven:maven-settings:jar:2.0.9
[09:53:15][com.su:employee] [main] DEBUG org.apache.maven.classrealm.DefaultClassRealmManager -   Excluded: org.apache.maven:maven-plugin-parameter-documenter:jar:2.0.9
[09:53:15][com.su:employee] [main] DEBUG org.apache.maven.classrealm.DefaultClassRealmManager -   Excluded: org.apache.maven:maven-profile:jar:2.0.9
[09:53:15][com.su:employee] [main] DEBUG org.apache.maven.classrealm.DefaultClassRealmManager -   Excluded: org.apache.maven:maven-model:jar:2.0.9
[09:53:15][com.su:employee] [main] DEBUG org.apache.maven.classrealm.DefaultClassRealmManager -   Excluded: org.apache.maven:maven-repository-metadata:jar:2.0.9
[09:53:15][com.su:employee] [main] DEBUG org.apache.maven.classrealm.DefaultClassRealmManager -   Excluded: org.apache.maven:maven-error-diagnostics:jar:2.0.9
[09:53:15][com.su:employee] [main] DEBUG org.apache.maven.classrealm.DefaultClassRealmManager -   Excluded: org.apache.maven:maven-project:jar:2.0.9
[09:53:15][com.su:employee] [main] DEBUG org.apache.maven.classrealm.DefaultClassRealmManager -   Excluded: org.apache.maven:maven-plugin-registry:jar:2.0.9
[09:53:15][com.su:employee] [main] DEBUG org.apache.maven.classrealm.DefaultClassRealmManager -   Excluded: org.apache.maven:maven-plugin-descriptor:jar:2.0.9
[09:53:15][com.su:employee] [main] DEBUG org.apache.maven.classrealm.DefaultClassRealmManager -   Excluded: org.apache.maven:maven-artifact-manager:jar:2.0.9
[09:53:15][com.su:employee] [main] DEBUG org.apache.maven.classrealm.DefaultClassRealmManager -   Excluded: org.apache.maven:maven-monitor:jar:2.0.9
[09:53:15][com.su:employee] [main] DEBUG org.apache.maven.classrealm.DefaultClassRealmManager -   Excluded: org.apache.maven:maven-toolchain:jar:1.0
[09:53:15][com.su:employee] [main] DEBUG org.apache.maven.classrealm.DefaultClassRealmManager -   Excluded: org.codehaus.plexus:plexus-container-default:jar:1.0-alpha-9-stable-1
[09:53:15][com.su:employee] [main] DEBUG org.apache.maven.classrealm.DefaultClassRealmManager -   Excluded: classworlds:classworlds:jar:1.1-alpha-2
[09:53:15][com.su:employee] [main] DEBUG org.apache.maven.plugin.internal.DefaultMavenPluginManager - Configuring mojo org.apache.maven.plugins:maven-compiler-plugin:2.5.1:compile from plugin realm ClassRealm[plugin>org.apache.maven.plugins:maven-compiler-plugin:2.5.1, parent: sun.misc.Launcher$AppClassLoader@1497b7b1]
[09:53:15][com.su:employee] [main] DEBUG org.apache.maven.plugin.internal.DefaultMavenPluginManager - Configuring mojo 'org.apache.maven.plugins:maven-compiler-plugin:2.5.1:compile' with basic configurator -->
[09:53:15][com.su:employee] [main] DEBUG org.apache.maven.plugin.internal.DefaultMavenPluginManager -   (f) basedir = C:\TeamCity\buildAgent\work\473a7ed72e7b745e\employee
[09:53:15][com.su:employee] [main] DEBUG org.apache.maven.plugin.internal.DefaultMavenPluginManager -   (f) buildDirectory = C:\TeamCity\buildAgent\work\473a7ed72e7b745e\employee\target
[09:53:15][com.su:employee] [main] DEBUG org.apache.maven.plugin.internal.DefaultMavenPluginManager -   (f) classpathElements = [C:\TeamCity\buildAgent\work\473a7ed72e7b745e\employee\target\classes, C:\.m2\repository\org\springframework\spring-core\3.0.5.RELEASE\spring-core-3.0.5.RELEASE.jar, C:\.m2\repository\org\springframework\spring-asm\3.0.5.RELEASE\spring-asm-3.0.5.RELEASE.jar, C:\.m2\repository\commons-logging\commons-logging\1.1.1\commons-logging-1.1.1.jar, C:\.m2\repository\org\springframework\spring-context\3.0.5.RELEASE\spring-context-3.0.5.RELEASE.jar, C:\.m2\repository\org\springframework\spring-aop\3.0.5.RELEASE\spring-aop-3.0.5.RELEASE.jar, C:\.m2\repository\aopalliance\aopalliance\1.0\aopalliance-1.0.jar, C:\.m2\repository\org\springframework\spring-beans\3.0.5.RELEASE\spring-beans-3.0.5.RELEASE.jar, C:\.m2\repository\org\springframework\spring-expression\3.0.5.RELEASE\spring-expression-3.0.5.RELEASE.jar, C:\.m2\repository\postgresql\postgresql\9.1-901.jdbc4\postgresql-9.1-901.jdbc4.jar, C:\.m2\repository\org\springframework\spring-jdbc\3.0.5.RELEASE\spring-jdbc-3.0.5.RELEASE.jar, C:\.m2\repository\org\springframework\spring-tx\3.0.5.RELEASE\spring-tx-3.0.5.RELEASE.jar]
[09:53:15][com.su:employee] [main] DEBUG org.apache.maven.plugin.internal.DefaultMavenPluginManager -   (f) compileSourceRoots = [C:\TeamCity\buildAgent\work\473a7ed72e7b745e\employee\src\main\java]
[09:53:15][com.su:employee] [main] DEBUG org.apache.maven.plugin.internal.DefaultMavenPluginManager -   (f) compilerId = javac
[09:53:15][com.su:employee] [main] DEBUG org.apache.maven.plugin.internal.DefaultMavenPluginManager -   (f) debug = true
[09:53:15][com.su:employee] [main] DEBUG org.apache.maven.plugin.internal.DefaultMavenPluginManager -   (f) failOnError = true
[09:53:15][com.su:employee] [main] DEBUG org.apache.maven.plugin.internal.DefaultMavenPluginManager -   (f) fork = false
[09:53:15][com.su:employee] [main] DEBUG org.apache.maven.plugin.internal.DefaultMavenPluginManager -   (f) generatedSourcesDirectory = C:\TeamCity\buildAgent\work\473a7ed72e7b745e\employee\target\generated-sources\annotations
[09:53:15][com.su:employee] [main] DEBUG org.apache.maven.plugin.internal.DefaultMavenPluginManager -   (f) optimize = false
[09:53:15][com.su:employee] [main] DEBUG org.apache.maven.plugin.internal.DefaultMavenPluginManager -   (f) outputDirectory = C:\TeamCity\buildAgent\work\473a7ed72e7b745e\employee\target\classes
[09:53:15][com.su:employee] [main] DEBUG org.apache.maven.plugin.internal.DefaultMavenPluginManager -   (f) outputFileName = employee-1.0-SNAPSHOT
[09:53:15][com.su:employee] [main] DEBUG org.apache.maven.plugin.internal.DefaultMavenPluginManager -   (f) projectArtifact = com.su:employee:jar:1.0-SNAPSHOT
[09:53:15][com.su:employee] [main] DEBUG org.apache.maven.plugin.internal.DefaultMavenPluginManager -   (f) session = org.apache.maven.execution.MavenSession@40b27ffb
[09:53:15][com.su:employee] [main] DEBUG org.apache.maven.plugin.internal.DefaultMavenPluginManager -   (f) showDeprecation = false
[09:53:15][com.su:employee] [main] DEBUG org.apache.maven.plugin.internal.DefaultMavenPluginManager -   (f) showWarnings = false
[09:53:15][com.su:employee] [main] DEBUG org.apache.maven.plugin.internal.DefaultMavenPluginManager -   (f) source = 1.5
[09:53:15][com.su:employee] [main] DEBUG org.apache.maven.plugin.internal.DefaultMavenPluginManager -   (f) staleMillis = 0
[09:53:15][com.su:employee] [main] DEBUG org.apache.maven.plugin.internal.DefaultMavenPluginManager -   (f) target = 1.5
[09:53:15][com.su:employee] [main] DEBUG org.apache.maven.plugin.internal.DefaultMavenPluginManager -   (f) verbose = false
[09:53:15][com.su:employee] [main] DEBUG org.apache.maven.plugin.internal.DefaultMavenPluginManager - -- end configuration --
[09:53:15][com.su:employee] [main] DEBUG org.apache.maven.plugin.CompilerMojo - Using compiler 'javac'.
[09:53:15][com.su:employee] [main] DEBUG org.apache.maven.plugin.CompilerMojo - Source directories: [C:\TeamCity\buildAgent\work\473a7ed72e7b745e\employee\src\main\java]
[09:53:15][com.su:employee] [main] DEBUG org.apache.maven.plugin.CompilerMojo - Classpath: [C:\TeamCity\buildAgent\work\473a7ed72e7b745e\employee\target\classes
[09:53:15][com.su:employee] C:\.m2\repository\org\springframework\spring-core\3.0.5.RELEASE\spring-core-3.0.5.RELEASE.jar
[09:53:15][com.su:employee] C:\.m2\repository\org\springframework\spring-asm\3.0.5.RELEASE\spring-asm-3.0.5.RELEASE.jar
[09:53:15][com.su:employee] C:\.m2\repository\commons-logging\commons-logging\1.1.1\commons-logging-1.1.1.jar
[09:53:15][com.su:employee] C:\.m2\repository\org\springframework\spring-context\3.0.5.RELEASE\spring-context-3.0.5.RELEASE.jar
[09:53:15][com.su:employee] C:\.m2\repository\org\springframework\spring-aop\3.0.5.RELEASE\spring-aop-3.0.5.RELEASE.jar
[09:53:15][com.su:employee] C:\.m2\repository\aopalliance\aopalliance\1.0\aopalliance-1.0.jar
[09:53:15][com.su:employee] C:\.m2\repository\org\springframework\spring-beans\3.0.5.RELEASE\spring-beans-3.0.5.RELEASE.jar
[09:53:15][com.su:employee] C:\.m2\repository\org\springframework\spring-expression\3.0.5.RELEASE\spring-expression-3.0.5.RELEASE.jar
[09:53:15][com.su:employee] C:\.m2\repository\postgresql\postgresql\9.1-901.jdbc4\postgresql-9.1-901.jdbc4.jar
[09:53:15][com.su:employee] C:\.m2\repository\org\springframework\spring-jdbc\3.0.5.RELEASE\spring-jdbc-3.0.5.RELEASE.jar
[09:53:15][com.su:employee] C:\.m2\repository\org\springframework\spring-tx\3.0.5.RELEASE\spring-tx-3.0.5.RELEASE.jar]
[09:53:15][com.su:employee] [main] DEBUG org.apache.maven.plugin.CompilerMojo - Output directory: C:\TeamCity\buildAgent\work\473a7ed72e7b745e\employee\target\classes
[09:53:15][com.su:employee] [main] DEBUG org.apache.maven.plugin.CompilerMojo - CompilerReuseStrategy: reuseCreated
[09:53:15][com.su:employee] [main] INFO org.apache.maven.plugin.CompilerMojo - Nothing to compile - all classes are up to date
[09:53:15][com.su:employee] [main] INFO org.apache.maven.cli.event.ExecutionEventLogger -
[09:53:15][com.su:employee] [main] INFO org.apache.maven.cli.event.ExecutionEventLogger - --- maven-resources-plugin:2.6:testResources (default-testResources) @ employee ---
[09:53:15][com.su:employee] [main] DEBUG org.apache.maven.plugin.internal.DefaultMavenPluginManager - Configuring mojo org.apache.maven.plugins:maven-resources-plugin:2.6:testResources from plugin realm ClassRealm[plugin>org.apache.maven.plugins:maven-resources-plugin:2.6, parent: sun.misc.Launcher$AppClassLoader@1497b7b1]
[09:53:15][com.su:employee] [main] DEBUG org.apache.maven.plugin.internal.DefaultMavenPluginManager - Configuring mojo 'org.apache.maven.plugins:maven-resources-plugin:2.6:testResources' with basic configurator -->
[09:53:15][com.su:employee] [main] DEBUG org.apache.maven.plugin.internal.DefaultMavenPluginManager -   (f) buildFilters = []
[09:53:15][com.su:employee] [main] DEBUG org.apache.maven.plugin.internal.DefaultMavenPluginManager -   (f) escapeWindowsPaths = true
[09:53:15][com.su:employee] [main] DEBUG org.apache.maven.plugin.internal.DefaultMavenPluginManager -   (s) includeEmptyDirs = false
[09:53:15][com.su:employee] [main] DEBUG org.apache.maven.plugin.internal.DefaultMavenPluginManager -   (s) outputDirectory = C:\TeamCity\buildAgent\work\473a7ed72e7b745e\employee\target\test-classes
[09:53:15][com.su:employee] [main] DEBUG org.apache.maven.plugin.internal.DefaultMavenPluginManager -   (s) overwrite = false
[09:53:15][com.su:employee] [main] DEBUG org.apache.maven.plugin.internal.DefaultMavenPluginManager -   (f) project = MavenProject: com.su:employee:1.0-SNAPSHOT @ C:\TeamCity\buildAgent\work\473a7ed72e7b745e\employee\pom.xml
[09:53:15][com.su:employee] [main] DEBUG org.apache.maven.plugin.internal.DefaultMavenPluginManager -   (s) resources = [Resource {targetPath: null, filtering: false, FileSet {directory: C:\TeamCity\buildAgent\work\473a7ed72e7b745e\employee\src\test\resources, PatternSet [includes: {}, excludes: {}]}}]
[09:53:15][com.su:employee] [main] DEBUG org.apache.maven.plugin.internal.DefaultMavenPluginManager -   (f) session = org.apache.maven.execution.MavenSession@40b27ffb
[09:53:15][com.su:employee] [main] DEBUG org.apache.maven.plugin.internal.DefaultMavenPluginManager -   (f) supportMultiLineFiltering = false
[09:53:15][com.su:employee] [main] DEBUG org.apache.maven.plugin.internal.DefaultMavenPluginManager -   (f) useBuildFilters = true
[09:53:15][com.su:employee] [main] DEBUG org.apache.maven.plugin.internal.DefaultMavenPluginManager -   (s) useDefaultDelimiters = true
[09:53:15][com.su:employee] [main] DEBUG org.apache.maven.plugin.internal.DefaultMavenPluginManager - -- end configuration --
[09:53:15][com.su:employee] [main] DEBUG org.apache.maven.shared.filtering.DefaultMavenFileFilter - properties used {file.encoding.pkg=sun.io, env.CONFIGSETROOT=C:\WINDOWS\ConfigSetRoot, java.home=C:\Program Files\Java\jdk1.7.0_45\jre, teamcity.projectName=MainProject, env.JDK_17=c:\program files\java\jdk1.7.0_45, classworlds.conf=C:\TeamCity\buildAgent\temp\buildTmp\teamcity.m2.conf, java.endorsed.dirs=C:\Program Files\Java\jdk1.7.0_45\jre\lib\endorsed, env.USERNAME=JACKBIGLAPTOP$, teamcity.configuration.properties.file=C:\TeamCity\buildAgent\temp\buildTmp\teamcity.config5756304132928804850.properties, sun.os.patch.level=, teamcity.version=8.0.5 (build 27692), java.vendor.url=http://java.oracle.com/, env.COMPUTERNAME=JACKBIGLAPTOP, env.=C:=c:\TeamCity\buildAgent\bin, env.TEAMCITY_PROCESS_PARENT_FLOW_ID=, build.vcs.number.MainProject_MainProject=5, java.version=1.7.0_45, com.jetbrains.maven.watcher.report.file=C:\TeamCity\buildAgent\temp\buildTmp\maven-build-info.xml, java.vendor.url.bug=http://bugreport.sun.com/bugreport/, env.USERPROFILE=C:\WINDOWS\system32\config\systemprofile, teamcity.build.tempDir=C:\TeamCity\buildAgent\temp\buildTmp, user.name=JACKBIGLAPTOP$, build.number=6, sun.io.unicode.encoding=UnicodeLittle, agent.ownPort=9090, sun.jnu.encoding=Cp1252, java.runtime.name=Java(TM) SE Runtime Environment, env.LOCALAPPDATA=C:\WINDOWS\system32\config\systemprofile\AppData\Local, env.COMMONPROGRAMW6432=C:\Program Files\Common Files, java.specification.name=Java Platform API Specification, teamcity.maven.watcher.home=C:\TeamCity\buildAgent\plugins\mavenPlugin\maven-watcher, user.timezone=America/New_York, user.script=, path.separator=;, postgresql.version=9.1-901.jdbc4, env.PROCESSOR_IDENTIFIER=Intel64 Family 6 Model 58 Stepping 9, GenuineIntel, file.encoding=Cp1252, sun.java.command=org.codehaus.plexus.classworlds.launcher.Launcher -f C:\TeamCity\buildAgent\work\473a7ed72e7b745e\pom.xml -B deploy -X -e, env.NUMBER_OF_PROCESSORS=4, env.APPDATA=C:\WINDOWS\system32\config\systemprofile\AppData\Roaming, env.WINDIR=C:\WINDOWS, env.WRAPPER_BITS=32, env.TEAMCITY_PROJECT_NAME=MainProject, java.io.tmpdir=C:\TeamCity\buildAgent\temp\buildTmp, user.language=en, line.separator=
[09:53:15][com.su:employee] , maven.repo.local=C:/.m2/repository, env.TEAMCITY_JRE=C:\Program Files\Java\jdk1.7.0_45, env.WRAPPER_FILE_SEPARATOR=\, env.COMMONPROGRAMFILES=C:\Program Files\Common Files, agent.name=JackBigLaptop, java.vm.info=mixed mode, sun.desktop=windows, java.vm.specification.name=Java Virtual Machine Specification, env.WRAPPER_OS=windows, teamcity.dotnet.nunitlauncher1.1=C:\TeamCity\buildAgent\plugins\dotnetPlugin\bin\JetBrains.BuildServer.NUnitLauncher1.1.exe, teamcity.dotnet.nunitaddin=C:\TeamCity\buildAgent\plugins\dotnetPlugin\bin\JetBrains.TeamCity.NUnitAddin-NUnit, teamcity.coverage.runner=IDEA, env.M2_HOME=c:\users\su\maven, env.PATHEXT=.COM;.EXE;.BAT;.CMD;.VBS;.VBE;.JS;.JSE;.WSF;.WSH;.MSC, teamcity.coverage.idea.excludePatterns=**/*Test.java, env.PSMODULEPATH=C:\WINDOWS\system32\WindowsPowerShell\v1.0\Modules\, env.TEAMCITY_PROCESS_FLOW_ID=297235474647310, java.awt.printerjob=sun.awt.windows.WPrinterJob, teamcity.agent.dotnet.agent_url=http://localhost:9090/RPC2, teamcity.buildConfName=MainProject, env.TEAMCITY_BUILD_PROPERTIES_FILE=C:\TeamCity\buildAgent\temp\buildTmp\teamcity.build1110773657545620537.properties, env.PUBLIC=C:\Users\Public, env.USERDOMAIN=WORKGROUP, env.BUILD_VCS_NUMBER=5, teamcity.coverage.idea.includePatterns=**/main/src/**/*.java, build.vcs.number.1=5, env.VISUALSVN_SERVER=C:\Program Files (x86)\VisualSVN Server\, env.PROCESSOR_LEVEL=6, env.PROGRAMFILES(X86)=C:\Program Files (x86), env.BUILD_NUMBER=6, os.name=Windows 8, java.specification.vendor=Oracle Corporation, env.TMP=C:\TeamCity\buildAgent\temp\buildTmp, java.vm.name=Java HotSpot(TM) 64-Bit Server VM, maven.surefire.debug='-javaagent:C:\TeamCity\buildAgent\plugins\coveragePlugin\coverage-agent.jar=C:\TeamCity\buildAgent\temp\buildTmp\coverage4048126807686829421args', teamcity.dotnet.platform=C:\TeamCity\buildAgent\plugins\dotnetPlugin\bin\JetBrains.TeamCity.PlatformProcessRunner.1.1.exe, env.OS=Windows_NT, java.library.path=C:\Program Files\Java\jdk1.7.0_45\bin;C:\WINDOWS\Sun\Java\bin;C:\WINDOWS\system32;C:\WINDOWS;c:\users\su\maven\bin;C:\Program Files\CollabNet\Subversion Client;C:\app\oracle\product\12.1.0\dbhome_1\bin;%MAVEN_HOME%\bin;c:\program files\java\jdk1.7.0_45\bin;C:\Program Files (x86)\Intel\iCLS Client\;C:\Program Files\Intel\iCLS Client\;C:\WINDOWS\system32;C:\WINDOWS;C:\WINDOWS\System32\Wbem;C:\WINDOWS\System32\WindowsPowerShell\v1.0\;C:\Program Files (x86)\Intel\OpenCL SDK\2.0\bin\x86;C:\Program Files (x86)\Intel\OpenCL SDK\2.0\bin\x64;C:\Program Files\Intel\Intel(R) Management Engine Components\DAL;C:\Program Files\Intel\Intel(R) Management Engine Components\IPT;C:\Program Files (x86)\Intel\Intel(R) Management Engine Components\DAL;C:\Program Files (x86)\Intel\Intel(R) Management Engine Components\IPT;C:\Program Files\Lenovo\Bluetooth Software\;C:\Program Files\Lenovo\Bluetooth Software\syswow64;C:\Program Files (x86)\VisualSVN Server\bin;;., env.PROGRAMW6432=C:\Program Files, env.PATH=c:\users\su\maven\bin;C:\Program Files\CollabNet\Subversion Client;C:\app\oracle\product\12.1.0\dbhome_1\bin;%MAVEN_HOME%\bin;c:\program files\java\jdk1.7.0_45\bin;C:\Program Files (x86)\Intel\iCLS Client\;C:\Program Files\Intel\iCLS Client\;C:\WINDOWS\system32;C:\WINDOWS;C:\WINDOWS\System32\Wbem;C:\WINDOWS\System32\WindowsPowerShell\v1.0\;C:\Program Files (x86)\Intel\OpenCL SDK\2.0\bin\x86;C:\Program Files (x86)\Intel\OpenCL SDK\2.0\bin\x64;C:\Program Files\Intel\Intel(R) Management Engine Components\DAL;C:\Program Files\Intel\Intel(R) Management Engine Components\IPT;C:\Program Files (x86)\Intel\Intel(R) Management Engine Components\DAL;C:\Program Files (x86)\Intel\Intel(R) Management Engine Components\IPT;C:\Program Files\Lenovo\Bluetooth Software\;C:\Program Files\Lenovo\Bluetooth Software\syswow64;C:\Program Files (x86)\VisualSVN Server\bin;, env.JDK_HOME=c:\program files\java\jdk1.7.0_45, java.class.version=51.0, env.TEAMCITY_CAPTURE_ENV=c:\TeamCity\jre\bin\java.exe -jar C:\TeamCity\buildAgent\plugins\environment-fetcher\bin\env-fetcher.jar, teamcity.build.checkoutDir=C:\TeamCity\buildAgent\work\473a7ed72e7b745e, teamcity.auth.userId=TeamCityBuildId=18, teamcity.build.properties.file=C:\TeamCity\buildAgent\temp\buildTmp\teamcity.build1110773657545620537.properties, env.SYSTEMROOT=C:\WINDOWS, spring.version=3.0.5.RELEASE, env.COMSPEC=C:\WINDOWS\system32\cmd.exe, teamcity.buildType.id=MainProject_MainProject, sun.boot.library.path=C:\Program Files\Java\jdk1.7.0_45\jre\bin, teamcity.dotnet.nunitlauncher=C:\TeamCity\buildAgent\plugins\dotnetPlugin\bin\JetBrains.BuildServer.NUnitLauncher.exe, env.SYSTEMDRIVE=C:, env.PROCESSOR_REVISION=3a09, sun.management.compiler=HotSpot 64-Bit Tiered Compilers, env.BUILD_VCS_NUMBER_MAINPROJECT_MAINPROJECT=5, java.awt.graphicsenv=sun.awt.Win32GraphicsEnvironment, user.variant=, env.JDK_17_X64=c:\program files\java\jdk1.7.0_45, env.JRE_HOME=c:\program files\java\jdk1.7.0_45, env.WRAPPER_PATH_SEPARATOR=;, build.vcs.number=5, env.PROGRAMFILES=C:\Program Files, java.vm.specification.version=1.7, teamcity.dotnet.nunitlauncher2.0.vsts=C:\TeamCity\buildAgent\plugins\dotnetPlugin\bin\JetBrains.BuildServer.NUnitLauncher2.0.VSTS.exe, env.PROGRAMDATA=C:\ProgramData, awt.toolkit=sun.awt.windows.WToolkit, sun.cpu.isalist=amd64, java.ext.dirs=C:\Program Files\Java\jdk1.7.0_45\jre\lib\ext;C:\WINDOWS\Sun\Java\lib\ext, os.version=6.2, user.home=C:\, java.vm.vendor=Oracle Corporation, env.JAVA_HOME=c:\program files\java\jdk1.7.0_45, teamcity.tests.recentlyFailedTests.file=C:\TeamCity\buildAgent\temp\buildTmp\testsToRunFirst3186172005812643486.txt, user.dir=C:\TeamCity\buildAgent\work\473a7ed72e7b745e, env.COMMONPROGRAMFILES(X86)=C:\Program Files (x86)\Common Files, env.FP_NO_HOST_CHECK=NO, teamcity.build.id=18, teamcity.build.changedFiles.file=C:\TeamCity\buildAgent\temp\buildTmp\changedFiles7271889642607539483.txt, sun.cpu.endian=little, teamcity.auth.password=d7lfdBOB5rdSN8R2s6zGy6TVM5tjurTp, agent.home.dir=C:\TeamCity\buildAgent, teamcity.runner.properties.file=C:\TeamCity\buildAgent\temp\buildTmp\teamcity.runner624609232819970536.properties, env.ALLUSERSPROFILE=C:\ProgramData, env.TMPDIR=C:\TeamCity\buildAgent\temp\buildTmp, env.TEAMCITY_VERSION=8.0.5 (build 27692), env.PROCESSOR_ARCHITECTURE=AMD64, teamcity.build.workingDir=C:\TeamCity\buildAgent\work\473a7ed72e7b745e, env.TEAMCITY_DATA_PATH=C:\ProgramData\JetBrains\TeamCity, java.vm.version=24.45-b08, java.class.path=c:\users\su\maven\boot\plexus-classworlds-2.5.1.jar;, org.slf4j.simpleLogger.defaultLogLevel=debug, os.arch=amd64, maven.build.version=Apache Maven 3.1.1 (0728685237757ffbf44136acec0402957f723d9a; 2013-09-17 11:22:22-0400), teamcity.agent.cpuBenchmark=540, sun.java.launcher=SUN_STANDARD, teamcity.dotnet.nunitlauncher2.0=C:\TeamCity\buildAgent\plugins\dotnetPlugin\bin\JetBrains.BuildServer.NUnitLauncher2.0.exe, java.vm.specification.vendor=Oracle Corporation, teamcity.agent.dotnet.build_id=18, file.separator=\, env.WRAPPER_ARCH=x86, java.runtime.version=1.7.0_45-b18, sun.boot.class.path=C:\Program Files\Java\jdk1.7.0_45\jre\lib\resources.jar;C:\Program Files\Java\jdk1.7.0_45\jre\lib\rt.jar;C:\Program Files\Java\jdk1.7.0_45\jre\lib\sunrsasign.jar;C:\Program Files\Java\jdk1.7.0_45\jre\lib\jsse.jar;C:\Program Files\Java\jdk1.7.0_45\jre\lib\jce.jar;C:\Program Files\Java\jdk1.7.0_45\jre\lib\charsets.jar;C:\Program Files\Java\jdk1.7.0_45\jre\lib\jfr.jar;C:\Program Files\Java\jdk1.7.0_45\jre\classes, maven.failsafe.debug='-javaagent:C:\TeamCity\buildAgent\plugins\coveragePlugin\coverage-agent.jar=C:\TeamCity\buildAgent\temp\buildTmp\coverage4048126807686829421args', maven.version=3.1.1, env.TEAMCITY_BUILDCONF_NAME=MainProject, env.TEMP=C:\TeamCity\buildAgent\temp\buildTmp, user.country=US, agent.work.dir=C:\TeamCity\buildAgent\work, maven.home=c:\users\su\maven, teamcity.coverage.idea.baseDir=C:\TeamCity\buildAgent\temp\buildTmp\idea6838037627955084418coverage, teamcity.dotnet.nunitlauncher.msbuild.task=C:\TeamCity\buildAgent\plugins\dotnetPlugin\bin\JetBrains.BuildServer.MSBuildLoggers.dll, java.vendor=Oracle Corporation, java.specification.version=1.7, sun.arch.data.model=64}
[09:53:15][com.su:employee] [main] WARN org.apache.maven.shared.filtering.DefaultMavenResourcesFiltering - Using platform encoding (Cp1252 actually) to copy filtered resources, i.e. build is platform dependent!
[09:53:15][com.su:employee] [main] DEBUG org.apache.maven.shared.filtering.DefaultMavenResourcesFiltering - resource with targetPath null
[09:53:15][com.su:employee] directory C:\TeamCity\buildAgent\work\473a7ed72e7b745e\employee\src\test\resources
[09:53:15][com.su:employee] excludes []
[09:53:15][com.su:employee] includes []
[09:53:15][com.su:employee] [main] INFO org.apache.maven.shared.filtering.DefaultMavenResourcesFiltering - skip non existing resourceDirectory C:\TeamCity\buildAgent\work\473a7ed72e7b745e\employee\src\test\resources
[09:53:15][com.su:employee] [main] DEBUG org.apache.maven.plugin.resources.TestResourcesMojo - no use filter components
[09:53:15][com.su:employee] [main] INFO org.apache.maven.cli.event.ExecutionEventLogger -
[09:53:15][com.su:employee] [main] INFO org.apache.maven.cli.event.ExecutionEventLogger - --- maven-compiler-plugin:2.5.1:testCompile (default-testCompile) @ employee ---
[09:53:15][com.su:employee] [main] DEBUG org.apache.maven.plugin.internal.DefaultMavenPluginManager - Configuring mojo org.apache.maven.plugins:maven-compiler-plugin:2.5.1:testCompile from plugin realm ClassRealm[plugin>org.apache.maven.plugins:maven-compiler-plugin:2.5.1, parent: sun.misc.Launcher$AppClassLoader@1497b7b1]
[09:53:15][com.su:employee] [main] DEBUG org.apache.maven.plugin.internal.DefaultMavenPluginManager - Configuring mojo 'org.apache.maven.plugins:maven-compiler-plugin:2.5.1:testCompile' with basic configurator -->
[09:53:15][com.su:employee] [main] DEBUG org.apache.maven.plugin.internal.DefaultMavenPluginManager -   (f) basedir = C:\TeamCity\buildAgent\work\473a7ed72e7b745e\employee
[09:53:15][com.su:employee] [main] DEBUG org.apache.maven.plugin.internal.DefaultMavenPluginManager -   (f) buildDirectory = C:\TeamCity\buildAgent\work\473a7ed72e7b745e\employee\target
[09:53:15][com.su:employee] [main] DEBUG org.apache.maven.plugin.internal.DefaultMavenPluginManager -   (f) classpathElements = [C:\TeamCity\buildAgent\work\473a7ed72e7b745e\employee\target\test-classes, C:\TeamCity\buildAgent\work\473a7ed72e7b745e\employee\target\classes, C:\.m2\repository\junit\junit\3.8.1\junit-3.8.1.jar, C:\.m2\repository\org\springframework\spring-core\3.0.5.RELEASE\spring-core-3.0.5.RELEASE.jar, C:\.m2\repository\org\springframework\spring-asm\3.0.5.RELEASE\spring-asm-3.0.5.RELEASE.jar, C:\.m2\repository\commons-logging\commons-logging\1.1.1\commons-logging-1.1.1.jar, C:\.m2\repository\org\springframework\spring-context\3.0.5.RELEASE\spring-context-3.0.5.RELEASE.jar, C:\.m2\repository\org\springframework\spring-aop\3.0.5.RELEASE\spring-aop-3.0.5.RELEASE.jar, C:\.m2\repository\aopalliance\aopalliance\1.0\aopalliance-1.0.jar, C:\.m2\repository\org\springframework\spring-beans\3.0.5.RELEASE\spring-beans-3.0.5.RELEASE.jar, C:\.m2\repository\org\springframework\spring-expression\3.0.5.RELEASE\spring-expression-3.0.5.RELEASE.jar, C:\.m2\repository\postgresql\postgresql\9.1-901.jdbc4\postgresql-9.1-901.jdbc4.jar, C:\.m2\repository\org\springframework\spring-jdbc\3.0.5.RELEASE\spring-jdbc-3.0.5.RELEASE.jar, C:\.m2\repository\org\springframework\spring-tx\3.0.5.RELEASE\spring-tx-3.0.5.RELEASE.jar]
[09:53:15][com.su:employee] [main] DEBUG org.apache.maven.plugin.internal.DefaultMavenPluginManager -   (f) compileSourceRoots = [C:\TeamCity\buildAgent\work\473a7ed72e7b745e\employee\src\test\java]
[09:53:15][com.su:employee] [main] DEBUG org.apache.maven.plugin.internal.DefaultMavenPluginManager -   (f) compilerId = javac
[09:53:15][com.su:employee] [main] DEBUG org.apache.maven.plugin.internal.DefaultMavenPluginManager -   (f) debug = true
[09:53:15][com.su:employee] [main] DEBUG org.apache.maven.plugin.internal.DefaultMavenPluginManager -   (f) failOnError = true
[09:53:15][com.su:employee] [main] DEBUG org.apache.maven.plugin.internal.DefaultMavenPluginManager -   (f) fork = false
[09:53:15][com.su:employee] [main] DEBUG org.apache.maven.plugin.internal.DefaultMavenPluginManager -   (f) generatedTestSourcesDirectory = C:\TeamCity\buildAgent\work\473a7ed72e7b745e\employee\target\generated-test-sources\test-annotations
[09:53:15][com.su:employee] [main] DEBUG org.apache.maven.plugin.internal.DefaultMavenPluginManager -   (f) optimize = false
[09:53:15][com.su:employee] [main] DEBUG org.apache.maven.plugin.internal.DefaultMavenPluginManager -   (f) outputDirectory = C:\TeamCity\buildAgent\work\473a7ed72e7b745e\employee\target\test-classes
[09:53:15][com.su:employee] [main] DEBUG org.apache.maven.plugin.internal.DefaultMavenPluginManager -   (f) outputFileName = employee-1.0-SNAPSHOT
[09:53:15][com.su:employee] [main] DEBUG org.apache.maven.plugin.internal.DefaultMavenPluginManager -   (f) session = org.apache.maven.execution.MavenSession@40b27ffb
[09:53:15][com.su:employee] [main] DEBUG org.apache.maven.plugin.internal.DefaultMavenPluginManager -   (f) showDeprecation = false
[09:53:15][com.su:employee] [main] DEBUG org.apache.maven.plugin.internal.DefaultMavenPluginManager -   (f) showWarnings = false
[09:53:15][com.su:employee] [main] DEBUG org.apache.maven.plugin.internal.DefaultMavenPluginManager -   (f) source = 1.5
[09:53:15][com.su:employee] [main] DEBUG org.apache.maven.plugin.internal.DefaultMavenPluginManager -   (f) staleMillis = 0
[09:53:15][com.su:employee] [main] DEBUG org.apache.maven.plugin.internal.DefaultMavenPluginManager -   (f) target = 1.5
[09:53:15][com.su:employee] [main] DEBUG org.apache.maven.plugin.internal.DefaultMavenPluginManager -   (f) verbose = false
[09:53:15][com.su:employee] [main] DEBUG org.apache.maven.plugin.internal.DefaultMavenPluginManager - -- end configuration --
[09:53:15][com.su:employee] [main] DEBUG org.apache.maven.plugin.TestCompilerMojo - Using compiler 'javac'.
[09:53:15][com.su:employee] [main] DEBUG org.apache.maven.plugin.TestCompilerMojo - Source directories: [C:\TeamCity\buildAgent\work\473a7ed72e7b745e\employee\src\test\java]
[09:53:15][com.su:employee] [main] DEBUG org.apache.maven.plugin.TestCompilerMojo - Classpath: [C:\TeamCity\buildAgent\work\473a7ed72e7b745e\employee\target\test-classes
[09:53:15][com.su:employee] C:\TeamCity\buildAgent\work\473a7ed72e7b745e\employee\target\classes
[09:53:15][com.su:employee] C:\.m2\repository\junit\junit\3.8.1\junit-3.8.1.jar
[09:53:15][com.su:employee] C:\.m2\repository\org\springframework\spring-core\3.0.5.RELEASE\spring-core-3.0.5.RELEASE.jar
[09:53:15][com.su:employee] C:\.m2\repository\org\springframework\spring-asm\3.0.5.RELEASE\spring-asm-3.0.5.RELEASE.jar
[09:53:15][com.su:employee] C:\.m2\repository\commons-logging\commons-logging\1.1.1\commons-logging-1.1.1.jar
[09:53:15][com.su:employee] C:\.m2\repository\org\springframework\spring-context\3.0.5.RELEASE\spring-context-3.0.5.RELEASE.jar
[09:53:15][com.su:employee] C:\.m2\repository\org\springframework\spring-aop\3.0.5.RELEASE\spring-aop-3.0.5.RELEASE.jar
[09:53:15][com.su:employee] C:\.m2\repository\aopalliance\aopalliance\1.0\aopalliance-1.0.jar
[09:53:15][com.su:employee] C:\.m2\repository\org\springframework\spring-beans\3.0.5.RELEASE\spring-beans-3.0.5.RELEASE.jar
[09:53:15][com.su:employee] C:\.m2\repository\org\springframework\spring-expression\3.0.5.RELEASE\spring-expression-3.0.5.RELEASE.jar
[09:53:15][com.su:employee] C:\.m2\repository\postgresql\postgresql\9.1-901.jdbc4\postgresql-9.1-901.jdbc4.jar
[09:53:15][com.su:employee] C:\.m2\repository\org\springframework\spring-jdbc\3.0.5.RELEASE\spring-jdbc-3.0.5.RELEASE.jar
[09:53:15][com.su:employee] C:\.m2\repository\org\springframework\spring-tx\3.0.5.RELEASE\spring-tx-3.0.5.RELEASE.jar]
[09:53:15][com.su:employee] [main] DEBUG org.apache.maven.plugin.TestCompilerMojo - Output directory: C:\TeamCity\buildAgent\work\473a7ed72e7b745e\employee\target\test-classes
[09:53:15][com.su:employee] [main] DEBUG org.apache.maven.plugin.TestCompilerMojo - CompilerReuseStrategy: reuseCreated
[09:53:15][com.su:employee] [main] INFO org.apache.maven.plugin.TestCompilerMojo - Nothing to compile - all classes are up to date
[09:53:15][com.su:employee] [main] INFO org.apache.maven.cli.event.ExecutionEventLogger -
[09:53:15][com.su:employee] [main] INFO org.apache.maven.cli.event.ExecutionEventLogger - --- maven-surefire-plugin:2.12.4:test (default-test) @ employee ---
[09:53:16][com.su:employee] [main] DEBUG org.eclipse.aether.internal.impl.DefaultDependencyCollector - Dependency collection stats: {ConflictMarker.analyzeTime=0, ConflictMarker.markTime=1, ConflictMarker.nodeCount=132, ConflictIdSorter.graphTime=0, ConflictIdSorter.topsortTime=0, ConflictIdSorter.conflictIdCount=27, ConflictIdSorter.conflictIdCycleCount=0, ConflictResolver.totalTime=5, ConflictResolver.conflictItemCount=77, DefaultDependencyCollector.collectTime=116, DefaultDependencyCollector.transformTime=6}
[09:53:16][com.su:employee] [main] DEBUG org.apache.maven.plugin.internal.DefaultPluginDependenciesResolver - org.apache.maven.plugins:maven-surefire-plugin:jar:2.12.4:
[09:53:16][com.su:employee] [main] DEBUG org.apache.maven.plugin.internal.DefaultPluginDependenciesResolver -    org.apache.maven:maven-plugin-api:jar:2.0.9:compile
[09:53:16][com.su:employee] [main] DEBUG org.apache.maven.plugin.internal.DefaultPluginDependenciesResolver -    org.apache.maven.surefire:surefire-booter:jar:2.12.4:compile
[09:53:16][com.su:employee] [main] DEBUG org.apache.maven.plugin.internal.DefaultPluginDependenciesResolver -       org.apache.maven.surefire:surefire-api:jar:2.12.4:compile
[09:53:16][com.su:employee] [main] DEBUG org.apache.maven.plugin.internal.DefaultPluginDependenciesResolver -    org.apache.maven.surefire:maven-surefire-common:jar:2.12.4:compile
[09:53:16][com.su:employee] [main] DEBUG org.apache.maven.plugin.internal.DefaultPluginDependenciesResolver -       org.apache.commons:commons-lang3:jar:3.1:compile
[09:53:16][com.su:employee] [main] DEBUG org.apache.maven.plugin.internal.DefaultPluginDependenciesResolver -       org.apache.maven.shared:maven-common-artifact-filters:jar:1.3:compile
[09:53:16][com.su:employee] [main] DEBUG org.apache.maven.plugin.internal.DefaultPluginDependenciesResolver -    org.codehaus.plexus:plexus-utils:jar:3.0.8:compile
[09:53:16][com.su:employee] [main] DEBUG org.apache.maven.plugin.internal.DefaultPluginDependenciesResolver -    org.apache.maven:maven-artifact:jar:2.0.9:compile
[09:53:16][com.su:employee] [main] DEBUG org.apache.maven.plugin.internal.DefaultPluginDependenciesResolver -    org.apache.maven:maven-project:jar:2.0.9:compile
[09:53:16][com.su:employee] [main] DEBUG org.apache.maven.plugin.internal.DefaultPluginDependenciesResolver -       org.apache.maven:maven-settings:jar:2.0.9:compile
[09:53:16][com.su:employee] [main] DEBUG org.apache.maven.plugin.internal.DefaultPluginDependenciesResolver -       org.apache.maven:maven-profile:jar:2.0.9:compile
[09:53:16][com.su:employee] [main] DEBUG org.apache.maven.plugin.internal.DefaultPluginDependenciesResolver -       org.apache.maven:maven-model:jar:2.0.9:compile
[09:53:16][com.su:employee] [main] DEBUG org.apache.maven.plugin.internal.DefaultPluginDependenciesResolver -       org.apache.maven:maven-artifact-manager:jar:2.0.9:compile
[09:53:16][com.su:employee] [main] DEBUG org.apache.maven.plugin.internal.DefaultPluginDependenciesResolver -       org.apache.maven:maven-plugin-registry:jar:2.0.9:compile
[09:53:16][com.su:employee] [main] DEBUG org.apache.maven.plugin.internal.DefaultPluginDependenciesResolver -       org.codehaus.plexus:plexus-container-default:jar:1.0-alpha-9-stable-1:compile
[09:53:16][com.su:employee] [main] DEBUG org.apache.maven.plugin.internal.DefaultPluginDependenciesResolver -          junit:junit:jar:3.8.1:test
[09:53:16][com.su:employee] [main] DEBUG org.apache.maven.plugin.internal.DefaultPluginDependenciesResolver -    org.apache.maven:maven-core:jar:2.0.9:compile
[09:53:16][com.su:employee] [main] DEBUG org.apache.maven.plugin.internal.DefaultPluginDependenciesResolver -       org.apache.maven:maven-plugin-parameter-documenter:jar:2.0.9:compile
[09:53:16][com.su:employee] [main] DEBUG org.apache.maven.plugin.internal.DefaultPluginDependenciesResolver -       org.apache.maven.reporting:maven-reporting-api:jar:2.0.9:compile
[09:53:16][com.su:employee] [main] DEBUG org.apache.maven.plugin.internal.DefaultPluginDependenciesResolver -       org.apache.maven:maven-repository-metadata:jar:2.0.9:compile
[09:53:16][com.su:employee] [main] DEBUG org.apache.maven.plugin.internal.DefaultPluginDependenciesResolver -       org.apache.maven:maven-error-diagnostics:jar:2.0.9:compile
[09:53:16][com.su:employee] [main] DEBUG org.apache.maven.plugin.internal.DefaultPluginDependenciesResolver -       org.apache.maven:maven-plugin-descriptor:jar:2.0.9:compile
[09:53:16][com.su:employee] [main] DEBUG org.apache.maven.plugin.internal.DefaultPluginDependenciesResolver -       org.apache.maven:maven-monitor:jar:2.0.9:compile
[09:53:16][com.su:employee] [main] DEBUG org.apache.maven.plugin.internal.DefaultPluginDependenciesResolver -       classworlds:classworlds:jar:1.1:compile
[09:53:16][com.su:employee] [main] DEBUG org.apache.maven.plugin.internal.DefaultPluginDependenciesResolver -    org.apache.maven:maven-toolchain:jar:2.0.9:compile
[09:53:16][com.su:employee] [main] DEBUG org.apache.maven.plugin.internal.DefaultPluginDependenciesResolver -    org.apache.maven.plugin-tools:maven-plugin-annotations:jar:3.1:compile
[09:53:16][com.su:employee] [main] DEBUG org.apache.maven.classrealm.DefaultClassRealmManager - Created new class realm plugin>org.apache.maven.plugins:maven-surefire-plugin:2.12.4
[09:53:16][com.su:employee] [main] DEBUG org.apache.maven.classrealm.DefaultClassRealmManager - Importing foreign packages into class realm plugin>org.apache.maven.plugins:maven-surefire-plugin:2.12.4
[09:53:16][com.su:employee] [main] DEBUG org.apache.maven.classrealm.DefaultClassRealmManager -   Imported:  < maven.api
[09:53:16][com.su:employee] [main] DEBUG org.apache.maven.classrealm.DefaultClassRealmManager - Populating class realm plugin>org.apache.maven.plugins:maven-surefire-plugin:2.12.4
[09:53:16][com.su:employee] [main] DEBUG org.apache.maven.classrealm.DefaultClassRealmManager -   Included: org.apache.maven.plugins:maven-surefire-plugin:jar:2.12.4
[09:53:16][com.su:employee] [main] DEBUG org.apache.maven.classrealm.DefaultClassRealmManager -   Included: org.apache.maven.surefire:surefire-booter:jar:2.12.4
[09:53:16][com.su:employee] [main] DEBUG org.apache.maven.classrealm.DefaultClassRealmManager -   Included: org.apache.maven.surefire:surefire-api:jar:2.12.4
[09:53:16][com.su:employee] [main] DEBUG org.apache.maven.classrealm.DefaultClassRealmManager -   Included: org.apache.maven.surefire:maven-surefire-common:jar:2.12.4
[09:53:16][com.su:employee] [main] DEBUG org.apache.maven.classrealm.DefaultClassRealmManager -   Included: org.apache.commons:commons-lang3:jar:3.1
[09:53:16][com.su:employee] [main] DEBUG org.apache.maven.classrealm.DefaultClassRealmManager -   Included: org.apache.maven.shared:maven-common-artifact-filters:jar:1.3
[09:53:16][com.su:employee] [main] DEBUG org.apache.maven.classrealm.DefaultClassRealmManager -   Included: org.codehaus.plexus:plexus-utils:jar:3.0.8
[09:53:16][com.su:employee] [main] DEBUG org.apache.maven.classrealm.DefaultClassRealmManager -   Included: org.apache.maven.reporting:maven-reporting-api:jar:2.0.9
[09:53:16][com.su:employee] [main] DEBUG org.apache.maven.classrealm.DefaultClassRealmManager -   Included: org.apache.maven.plugin-tools:maven-plugin-annotations:jar:3.1
[09:53:16][com.su:employee] [main] DEBUG org.apache.maven.classrealm.DefaultClassRealmManager -   Excluded: org.apache.maven:maven-plugin-api:jar:2.0.9
[09:53:16][com.su:employee] [main] DEBUG org.apache.maven.classrealm.DefaultClassRealmManager -   Excluded: org.apache.maven:maven-artifact:jar:2.0.9
[09:53:16][com.su:employee] [main] DEBUG org.apache.maven.classrealm.DefaultClassRealmManager -   Excluded: org.apache.maven:maven-project:jar:2.0.9
[09:53:16][com.su:employee] [main] DEBUG org.apache.maven.classrealm.DefaultClassRealmManager -   Excluded: org.apache.maven:maven-settings:jar:2.0.9
[09:53:16][com.su:employee] [main] DEBUG org.apache.maven.classrealm.DefaultClassRealmManager -   Excluded: org.apache.maven:maven-profile:jar:2.0.9
[09:53:16][com.su:employee] [main] DEBUG org.apache.maven.classrealm.DefaultClassRealmManager -   Excluded: org.apache.maven:maven-model:jar:2.0.9
[09:53:16][com.su:employee] [main] DEBUG org.apache.maven.classrealm.DefaultClassRealmManager -   Excluded: org.apache.maven:maven-artifact-manager:jar:2.0.9
[09:53:16][com.su:employee] [main] DEBUG org.apache.maven.classrealm.DefaultClassRealmManager -   Excluded: org.apache.maven:maven-plugin-registry:jar:2.0.9
[09:53:16][com.su:employee] [main] DEBUG org.apache.maven.classrealm.DefaultClassRealmManager -   Excluded: org.codehaus.plexus:plexus-container-default:jar:1.0-alpha-9-stable-1
[09:53:16][com.su:employee] [main] DEBUG org.apache.maven.classrealm.DefaultClassRealmManager -   Excluded: junit:junit:jar:3.8.1
[09:53:16][com.su:employee] [main] DEBUG org.apache.maven.classrealm.DefaultClassRealmManager -   Excluded: org.apache.maven:maven-core:jar:2.0.9
[09:53:16][com.su:employee] [main] DEBUG org.apache.maven.classrealm.DefaultClassRealmManager -   Excluded: org.apache.maven:maven-plugin-parameter-documenter:jar:2.0.9
[09:53:16][com.su:employee] [main] DEBUG org.apache.maven.classrealm.DefaultClassRealmManager -   Excluded: org.apache.maven:maven-repository-metadata:jar:2.0.9
[09:53:16][com.su:employee] [main] DEBUG org.apache.maven.classrealm.DefaultClassRealmManager -   Excluded: org.apache.maven:maven-error-diagnostics:jar:2.0.9
[09:53:16][com.su:employee] [main] DEBUG org.apache.maven.classrealm.DefaultClassRealmManager -   Excluded: org.apache.maven:maven-plugin-descriptor:jar:2.0.9
[09:53:16][com.su:employee] [main] DEBUG org.apache.maven.classrealm.DefaultClassRealmManager -   Excluded: org.apache.maven:maven-monitor:jar:2.0.9
[09:53:16][com.su:employee] [main] DEBUG org.apache.maven.classrealm.DefaultClassRealmManager -   Excluded: classworlds:classworlds:jar:1.1
[09:53:16][com.su:employee] [main] DEBUG org.apache.maven.classrealm.DefaultClassRealmManager -   Excluded: org.apache.maven:maven-toolchain:jar:2.0.9
[09:53:16][com.su:employee] [main] DEBUG org.apache.maven.plugin.internal.DefaultMavenPluginManager - Configuring mojo org.apache.maven.plugins:maven-surefire-plugin:2.12.4:test from plugin realm ClassRealm[plugin>org.apache.maven.plugins:maven-surefire-plugin:2.12.4, parent: sun.misc.Launcher$AppClassLoader@1497b7b1]
[09:53:16][com.su:employee] [main] DEBUG org.apache.maven.plugin.internal.DefaultMavenPluginManager - Configuring mojo 'org.apache.maven.plugins:maven-surefire-plugin:2.12.4:test' with basic configurator -->
[09:53:16][com.su:employee] [main] DEBUG org.apache.maven.plugin.internal.DefaultMavenPluginManager -   (s) basedir = C:\TeamCity\buildAgent\work\473a7ed72e7b745e\employee
[09:53:16][com.su:employee] [main] DEBUG org.apache.maven.plugin.internal.DefaultMavenPluginManager -   (s) childDelegation = false
[09:53:16][com.su:employee] [main] DEBUG org.apache.maven.plugin.internal.DefaultMavenPluginManager -   (s) classesDirectory = C:\TeamCity\buildAgent\work\473a7ed72e7b745e\employee\target\classes
[09:53:16][com.su:employee] [main] DEBUG org.apache.maven.plugin.internal.DefaultMavenPluginManager -   (s) debugForkedProcess = '-javaagent:C:\TeamCity\buildAgent\plugins\coveragePlugin\coverage-agent.jar=C:\TeamCity\buildAgent\temp\buildTmp\coverage4048126807686829421args'
[09:53:16][com.su:employee] [main] DEBUG org.apache.maven.plugin.internal.DefaultMavenPluginManager -   (s) disableXmlReport = false
[09:53:16][com.su:employee] [main] DEBUG org.apache.maven.plugin.internal.DefaultMavenPluginManager -   (s) enableAssertions = true
[09:53:16][com.su:employee] [main] DEBUG org.apache.maven.plugin.internal.DefaultMavenPluginManager -   (s) forkMode = once
[09:53:16][com.su:employee] [main] DEBUG org.apache.maven.plugin.internal.DefaultMavenPluginManager -   (s) junitArtifactName = junit:junit
[09:53:16][com.su:employee] [main] DEBUG org.apache.maven.plugin.internal.DefaultMavenPluginManager -   (s) localRepository =        id: local
[09:53:16][com.su:employee]       url: file:///C:/.m2/repository/
[09:53:16][com.su:employee]    layout: none
[09:53:16][com.su:employee]
[09:53:16][com.su:employee] [main] DEBUG org.apache.maven.plugin.internal.DefaultMavenPluginManager -   (f) parallelMavenExecution = false
[09:53:16][com.su:employee] [main] DEBUG org.apache.maven.plugin.internal.DefaultMavenPluginManager -   (s) perCoreThreadCount = true
[09:53:16][com.su:employee] [main] DEBUG org.apache.maven.plugin.internal.DefaultMavenPluginManager -   (s) pluginArtifactMap = {org.apache.maven.plugins:maven-surefire-plugin=org.apache.maven.plugins:maven-surefire-plugin:maven-plugin:2.12.4:, org.apache.maven.surefire:surefire-booter=org.apache.maven.surefire:surefire-booter:jar:2.12.4:compile, org.apache.maven.surefire:surefire-api=org.apache.maven.surefire:surefire-api:jar:2.12.4:compile, org.apache.maven.surefire:maven-surefire-common=org.apache.maven.surefire:maven-surefire-common:jar:2.12.4:compile, org.apache.commons:commons-lang3=org.apache.commons:commons-lang3:jar:3.1:compile, org.apache.maven.shared:maven-common-artifact-filters=org.apache.maven.shared:maven-common-artifact-filters:jar:1.3:compile, org.codehaus.plexus:plexus-utils=org.codehaus.plexus:plexus-utils:jar:3.0.8:compile, org.apache.maven.reporting:maven-reporting-api=org.apache.maven.reporting:maven-reporting-api:jar:2.0.9:compile, org.apache.maven.plugin-tools:maven-plugin-annotations=org.apache.maven.plugin-tools:maven-plugin-annotations:jar:3.1:compile}
[09:53:16][com.su:employee] [main] DEBUG org.apache.maven.plugin.internal.DefaultMavenPluginManager -   (f) pluginDescriptor = Component Descriptor: role: 'org.apache.maven.plugin.Mojo', implementation: 'org.apache.maven.plugin.surefire.HelpMojo', role hint: 'org.apache.maven.plugins:maven-surefire-plugin:2.12.4:help'
[09:53:16][com.su:employee] role: 'org.apache.maven.plugin.Mojo', implementation: 'org.apache.maven.plugin.surefire.SurefirePlugin', role hint: 'org.apache.maven.plugins:maven-surefire-plugin:2.12.4:test'
[09:53:16][com.su:employee] ---
[09:53:16][com.su:employee] [main] DEBUG org.apache.maven.plugin.internal.DefaultMavenPluginManager -   (s) printSummary = true
[09:53:16][com.su:employee] [main] DEBUG org.apache.maven.plugin.internal.DefaultMavenPluginManager -   (s) projectArtifactMap = {junit:junit=junit:junit:jar:3.8.1:test, org.springframework:spring-core=org.springframework:spring-core:jar:3.0.5.RELEASE:compile, org.springframework:spring-asm=org.springframework:spring-asm:jar:3.0.5.RELEASE:compile, commons-logging:commons-logging=commons-logging:commons-logging:jar:1.1.1:compile, org.springframework:spring-context=org.springframework:spring-context:jar:3.0.5.RELEASE:compile, org.springframework:spring-aop=org.springframework:spring-aop:jar:3.0.5.RELEASE:compile, aopalliance:aopalliance=aopalliance:aopalliance:jar:1.0:compile, org.springframework:spring-beans=org.springframework:spring-beans:jar:3.0.5.RELEASE:compile, org.springframework:spring-expression=org.springframework:spring-expression:jar:3.0.5.RELEASE:compile, postgresql:postgresql=postgresql:postgresql:jar:9.1-901.jdbc4:compile, org.springframework:spring-jdbc=org.springframework:spring-jdbc:jar:3.0.5.RELEASE:compile, org.springframework:spring-tx=org.springframework:spring-tx:jar:3.0.5.RELEASE:compile}
[09:53:16][com.su:employee] [main] DEBUG org.apache.maven.plugin.internal.DefaultMavenPluginManager -   (s) redirectTestOutputToFile = false
[09:53:16][com.su:employee] [main] DEBUG org.apache.maven.plugin.internal.DefaultMavenPluginManager -   (s) remoteRepositories = [       id: central
[09:53:16][com.su:employee]       url: http://repo.maven.apache.org/maven2
[09:53:16][com.su:employee]    layout: default
[09:53:16][com.su:employee] snapshots: [enabled => false, update => daily]
[09:53:16][com.su:employee] releases: [enabled => true, update => never]
[09:53:16][com.su:employee] ]
[09:53:16][com.su:employee] [main] DEBUG org.apache.maven.plugin.internal.DefaultMavenPluginManager -   (s) reportFormat = brief
[09:53:16][com.su:employee] [main] DEBUG org.apache.maven.plugin.internal.DefaultMavenPluginManager -   (s) reportsDirectory = C:\TeamCity\buildAgent\work\473a7ed72e7b745e\employee\target\surefire-reports
[09:53:16][com.su:employee] [main] DEBUG org.apache.maven.plugin.internal.DefaultMavenPluginManager -   (s) runOrder = filesystem
[09:53:16][com.su:employee] [main] DEBUG org.apache.maven.plugin.internal.DefaultMavenPluginManager -   (s) skip = false
[09:53:16][com.su:employee] [main] DEBUG org.apache.maven.plugin.internal.DefaultMavenPluginManager -   (s) skipTests = false
[09:53:16][com.su:employee] [main] DEBUG org.apache.maven.plugin.internal.DefaultMavenPluginManager -   (s) testClassesDirectory = C:\TeamCity\buildAgent\work\473a7ed72e7b745e\employee\target\test-classes
[09:53:16][com.su:employee] [main] DEBUG org.apache.maven.plugin.internal.DefaultMavenPluginManager -   (s) testFailureIgnore = false
[09:53:16][com.su:employee] [main] DEBUG org.apache.maven.plugin.internal.DefaultMavenPluginManager -   (s) testNGArtifactName = org.testng:testng
[09:53:16][com.su:employee] [main] DEBUG org.apache.maven.plugin.internal.DefaultMavenPluginManager -   (s) testSourceDirectory = C:\TeamCity\buildAgent\work\473a7ed72e7b745e\employee\src\test\java
[09:53:16][com.su:employee] [main] DEBUG org.apache.maven.plugin.internal.DefaultMavenPluginManager -   (s) trimStackTrace = true
[09:53:16][com.su:employee] [main] DEBUG org.apache.maven.plugin.internal.DefaultMavenPluginManager -   (s) useFile = true
[09:53:16][com.su:employee] [main] DEBUG org.apache.maven.plugin.internal.DefaultMavenPluginManager -   (s) useManifestOnlyJar = true
[09:53:16][com.su:employee] [main] DEBUG org.apache.maven.plugin.internal.DefaultMavenPluginManager -   (s) useSystemClassLoader = true
[09:53:16][com.su:employee] [main] DEBUG org.apache.maven.plugin.internal.DefaultMavenPluginManager -   (s) useUnlimitedThreads = false
[09:53:16][com.su:employee] [main] DEBUG org.apache.maven.plugin.internal.DefaultMavenPluginManager -   (s) workingDirectory = C:\TeamCity\buildAgent\work\473a7ed72e7b745e\employee
[09:53:16][com.su:employee] [main] DEBUG org.apache.maven.plugin.internal.DefaultMavenPluginManager -   (s) project = MavenProject: com.su:employee:1.0-SNAPSHOT @ C:\TeamCity\buildAgent\work\473a7ed72e7b745e\employee\pom.xml
[09:53:16][com.su:employee] [main] DEBUG org.apache.maven.plugin.internal.DefaultMavenPluginManager -   (s) session = org.apache.maven.execution.MavenSession@40b27ffb
[09:53:16][com.su:employee] [main] DEBUG org.apache.maven.plugin.internal.DefaultMavenPluginManager - -- end configuration --
[09:53:16][com.su:employee] [main] INFO org.apache.maven.plugin.surefire.SurefirePlugin - Surefire report directory: C:\TeamCity\buildAgent\work\473a7ed72e7b745e\employee\target\surefire-reports
[09:53:16][com.su:employee] [main] DEBUG org.apache.maven.plugin.surefire.SurefirePlugin - Setting system property [user.dir]=[C:\TeamCity\buildAgent\work\473a7ed72e7b745e\employee]
[09:53:16][com.su:employee] [main] DEBUG org.apache.maven.plugin.surefire.SurefirePlugin - Setting system property [localRepository]=[C:\.m2\repository]
[09:53:16][com.su:employee] [main] DEBUG org.apache.maven.plugin.surefire.SurefirePlugin - Setting system property [basedir]=[C:\TeamCity\buildAgent\work\473a7ed72e7b745e\employee]
[09:53:16][com.su:employee] [main] DEBUG org.apache.maven.artifact.resolver.DefaultArtifactResolver - dummy:dummy:jar:1.0 (selected for null)
[09:53:16][com.su:employee] [main] DEBUG org.apache.maven.artifact.resolver.DefaultArtifactResolver -   org.apache.maven.surefire:surefire-booter:jar:2.12.4:compile (selected for compile)
[09:53:16][com.su:employee] [main] DEBUG org.apache.maven.artifact.resolver.DefaultArtifactResolver -     org.apache.maven.surefire:surefire-api:jar:2.12.4:compile (selected for compile)
[09:53:16][com.su:employee] [main] DEBUG org.apache.maven.plugin.surefire.SurefirePlugin - Adding to surefire booter test classpath: C:\.m2\repository\org\apache\maven\surefire\surefire-booter\2.12.4\surefire-booter-2.12.4.jar Scope: compile
[09:53:16][com.su:employee] [main] DEBUG org.apache.maven.plugin.surefire.SurefirePlugin - Adding to surefire booter test classpath: C:\.m2\repository\org\apache\maven\surefire\surefire-api\2.12.4\surefire-api-2.12.4.jar Scope: compile
[09:53:16][com.su:employee] [main] DEBUG org.apache.maven.plugin.surefire.SurefirePlugin - Using JVM: C:\Program Files\Java\jdk1.7.0_45\jre\bin\java
[09:53:16][com.su:employee] [main] DEBUG org.apache.maven.artifact.resolver.DefaultArtifactResolver - dummy:dummy:jar:1.0 (selected for null)
[09:53:16][com.su:employee] [main] DEBUG org.apache.maven.artifact.resolver.DefaultArtifactResolver -   org.apache.maven.surefire:surefire-junit3:jar:2.12.4:test (selected for test)
[09:53:16][com.su:employee] [main] DEBUG org.apache.maven.artifact.resolver.DefaultArtifactResolver -     org.apache.maven.surefire:surefire-api:jar:2.12.4:test (selected for test)
[09:53:16][com.su:employee] [main] DEBUG org.apache.maven.plugin.surefire.SurefirePlugin - Adding to surefire test classpath: C:\.m2\repository\org\apache\maven\surefire\surefire-junit3\2.12.4\surefire-junit3-2.12.4.jar Scope: test
[09:53:16][com.su:employee] [main] DEBUG org.apache.maven.plugin.surefire.SurefirePlugin - Adding to surefire test classpath: C:\.m2\repository\org\apache\maven\surefire\surefire-api\2.12.4\surefire-api-2.12.4.jar Scope: test
[09:53:16][com.su:employee] [main] DEBUG org.apache.maven.plugin.surefire.SurefirePlugin - test classpath classpath:
[09:53:16][com.su:employee] [main] DEBUG org.apache.maven.plugin.surefire.SurefirePlugin -   C:\TeamCity\buildAgent\work\473a7ed72e7b745e\employee\target\test-classes
[09:53:16][com.su:employee] [main] DEBUG org.apache.maven.plugin.surefire.SurefirePlugin -   C:\TeamCity\buildAgent\work\473a7ed72e7b745e\employee\target\classes
[09:53:16][com.su:employee] [main] DEBUG org.apache.maven.plugin.surefire.SurefirePlugin -   C:\.m2\repository\junit\junit\3.8.1\junit-3.8.1.jar
[09:53:16][com.su:employee] [main] DEBUG org.apache.maven.plugin.surefire.SurefirePlugin -   C:\.m2\repository\org\springframework\spring-core\3.0.5.RELEASE\spring-core-3.0.5.RELEASE.jar
[09:53:16][com.su:employee] [main] DEBUG org.apache.maven.plugin.surefire.SurefirePlugin -   C:\.m2\repository\org\springframework\spring-asm\3.0.5.RELEASE\spring-asm-3.0.5.RELEASE.jar
[09:53:16][com.su:employee] [main] DEBUG org.apache.maven.plugin.surefire.SurefirePlugin -   C:\.m2\repository\commons-logging\commons-logging\1.1.1\commons-logging-1.1.1.jar
[09:53:16][com.su:employee] [main] DEBUG org.apache.maven.plugin.surefire.SurefirePlugin -   C:\.m2\repository\org\springframework\spring-context\3.0.5.RELEASE\spring-context-3.0.5.RELEASE.jar
[09:53:16][com.su:employee] [main] DEBUG org.apache.maven.plugin.surefire.SurefirePlugin -   C:\.m2\repository\org\springframework\spring-aop\3.0.5.RELEASE\spring-aop-3.0.5.RELEASE.jar
[09:53:16][com.su:employee] [main] DEBUG org.apache.maven.plugin.surefire.SurefirePlugin -   C:\.m2\repository\aopalliance\aopalliance\1.0\aopalliance-1.0.jar
[09:53:16][com.su:employee] [main] DEBUG org.apache.maven.plugin.surefire.SurefirePlugin -   C:\.m2\repository\org\springframework\spring-beans\3.0.5.RELEASE\spring-beans-3.0.5.RELEASE.jar
[09:53:16][com.su:employee] [main] DEBUG org.apache.maven.plugin.surefire.SurefirePlugin -   C:\.m2\repository\org\springframework\spring-expression\3.0.5.RELEASE\spring-expression-3.0.5.RELEASE.jar
[09:53:16][com.su:employee] [main] DEBUG org.apache.maven.plugin.surefire.SurefirePlugin -   C:\.m2\repository\postgresql\postgresql\9.1-901.jdbc4\postgresql-9.1-901.jdbc4.jar
[09:53:16][com.su:employee] [main] DEBUG org.apache.maven.plugin.surefire.SurefirePlugin -   C:\.m2\repository\org\springframework\spring-jdbc\3.0.5.RELEASE\spring-jdbc-3.0.5.RELEASE.jar
[09:53:16][com.su:employee] [main] DEBUG org.apache.maven.plugin.surefire.SurefirePlugin -   C:\.m2\repository\org\springframework\spring-tx\3.0.5.RELEASE\spring-tx-3.0.5.RELEASE.jar
[09:53:16][com.su:employee] [main] DEBUG org.apache.maven.plugin.surefire.SurefirePlugin - provider classpath classpath:
[09:53:16][com.su:employee] [main] DEBUG org.apache.maven.plugin.surefire.SurefirePlugin -   C:\.m2\repository\org\apache\maven\surefire\surefire-junit3\2.12.4\surefire-junit3-2.12.4.jar
[09:53:16][com.su:employee] [main] DEBUG org.apache.maven.plugin.surefire.SurefirePlugin -   C:\.m2\repository\org\apache\maven\surefire\surefire-api\2.12.4\surefire-api-2.12.4.jar
[09:53:16][com.su:employee]
[09:53:16][com.su:employee] -------------------------------------------------------
[09:53:16][com.su:employee] T E S T S
[09:53:16][com.su:employee] -------------------------------------------------------
[09:53:16][com.su:employee] Forking command line: cmd.exe /X /C ""C:\Program Files\Java\jdk1.7.0_45\jre\bin\java" -javaagent:C:\TeamCity\buildAgent\plugins\coveragePlugin\coverage-agent.jar=C:\TeamCity\buildAgent\temp\buildTmp\coverage4048126807686829421args -jar C:\TeamCity\buildAgent\work\473a7ed72e7b745e\employee\target\surefire\surefirebooter6085413275036869906.jar C:\TeamCity\buildAgent\work\473a7ed72e7b745e\employee\target\surefire\surefire4852071420699951753tmp C:\TeamCity\buildAgent\work\473a7ed72e7b745e\employee\target\surefire\surefire_07964847225755499921tmp"
[09:53:16][com.su:employee] ---- IntelliJ IDEA coverage runner ----
[09:53:16][com.su:employee] sampling ...
[09:53:16][com.su:employee] include patterns:
[09:53:16][com.su:employee] .*.*/main/src/.*.*/.*\.java(\$.*)?
[09:53:16][com.su:employee] exclude patterns:
[09:53:16][com.su:employee] Problem occurred with exclude pattern **/*Test.java(\$.*)?
[09:53:16][com.su:employee] Dangling meta character '*'
[09:53:16][com.su:employee] This may cause no tests run and no coverage collected
[09:53:16][com.su:employee]
[09:53:16][com.su:employee] Results :
[09:53:16][com.su:employee]
[09:53:16][com.su:employee] Tests run: 0, Failures: 0, Errors: 0, Skipped: 0
[09:53:16][com.su:employee]
[09:53:16][com.su:employee] [main] INFO org.apache.maven.cli.event.ExecutionEventLogger - ------------------------------------------------------------------------
[09:53:16][com.su:employee] Failed to execute goal org.apache.maven.plugins:maven-surefire-plugin:2.12.4:test (default-test) on project employee: Execution default-test of goal org.apache.maven.plugins:maven-surefire-plugin:2.12.4:test failed: The forked VM terminated without saying properly goodbye. VM crash or System.exit called ?
[09:53:16][com.su:employee] [main] INFO org.apache.maven.cli.event.ExecutionEventLogger - Reactor Summary:
[09:53:16][com.su:employee] [main] INFO org.apache.maven.cli.event.ExecutionEventLogger -
[09:53:16][Step 1/1] [main] INFO org.apache.maven.cli.event.ExecutionEventLogger - MainProject ....................................... SUCCESS [1.308s]
[09:53:16][Step 1/1] [main] INFO org.apache.maven.cli.event.ExecutionEventLogger - SpringOne ......................................... FAILURE [1.345s]
[09:53:16][Step 1/1] [main] INFO org.apache.maven.cli.event.ExecutionEventLogger - SpringOne ......................................... SKIPPED
[09:53:16][Step 1/1] [main] INFO org.apache.maven.cli.event.ExecutionEventLogger - ------------------------------------------------------------------------
[09:53:16][Step 1/1] [main] INFO org.apache.maven.cli.event.ExecutionEventLogger - BUILD FAILURE
[09:53:16][Step 1/1] [main] INFO org.apache.maven.cli.event.ExecutionEventLogger - ------------------------------------------------------------------------
[09:53:16][Step 1/1] [main] INFO org.apache.maven.cli.event.ExecutionEventLogger - Total time: 2.792s
[09:53:16][Step 1/1] [main] INFO org.apache.maven.cli.event.ExecutionEventLogger - Finished at: Fri Dec 27 09:53:16 EST 2013
[09:53:16][Step 1/1] [main] INFO org.apache.maven.cli.event.ExecutionEventLogger - Final Memory: 10M/153M
[09:53:16][Step 1/1] [main] INFO org.apache.maven.cli.event.ExecutionEventLogger - ------------------------------------------------------------------------
[09:53:16][Step 1/1] [main] ERROR org.apache.maven.cli.MavenCli - Failed to execute goal org.apache.maven.plugins:maven-surefire-plugin:2.12.4:test (default-test) on project employee: Execution default-test of goal org.apache.maven.plugins:maven-surefire-plugin:2.12.4:test failed: The forked VM terminated without saying properly goodbye. VM crash or System.exit called ? -> [Help 1]
[09:53:16][Step 1/1] org.apache.maven.lifecycle.LifecycleExecutionException: Failed to execute goal org.apache.maven.plugins:maven-surefire-plugin:2.12.4:test (default-test) on project employee: Execution default-test of goal org.apache.maven.plugins:maven-surefire-plugin:2.12.4:test failed: The forked VM terminated without saying properly goodbye. VM crash or System.exit called ?
[09:53:16][Step 1/1]      at org.apache.maven.lifecycle.internal.MojoExecutor.execute(MojoExecutor.java:224)
[09:53:16][Step 1/1]      at org.apache.maven.lifecycle.internal.MojoExecutor.execute(MojoExecutor.java:153)
[09:53:16][Step 1/1]      at org.apache.maven.lifecycle.internal.MojoExecutor.execute(MojoExecutor.java:145)
[09:53:16][Step 1/1]      at org.apache.maven.lifecycle.internal.LifecycleModuleBuilder.buildProject(LifecycleModuleBuilder.java:84)
[09:53:16][Step 1/1]      at org.apache.maven.lifecycle.internal.LifecycleModuleBuilder.buildProject(LifecycleModuleBuilder.java:59)
[09:53:16][Step 1/1]      at org.apache.maven.lifecycle.internal.LifecycleStarter.singleThreadedBuild(LifecycleStarter.java:183)
[09:53:16][Step 1/1]      at org.apache.maven.lifecycle.internal.LifecycleStarter.execute(LifecycleStarter.java:161)
[09:53:16][Step 1/1]      at org.apache.maven.DefaultMaven.doExecute(DefaultMaven.java:317)
[09:53:16][Step 1/1]      at org.apache.maven.DefaultMaven.execute(DefaultMaven.java:152)
[09:53:16][Step 1/1]      at org.apache.maven.cli.MavenCli.execute(MavenCli.java:555)
[09:53:16][Step 1/1]      at org.apache.maven.cli.MavenCli.doMain(MavenCli.java:214)
[09:53:16][Step 1/1]      at org.apache.maven.cli.MavenCli.main(MavenCli.java:158)
[09:53:16][Step 1/1]      at sun.reflect.NativeMethodAccessorImpl.invoke0(Native Method)
[09:53:16][Step 1/1]      at sun.reflect.NativeMethodAccessorImpl.invoke(NativeMethodAccessorImpl.java:57)
[09:53:16][Step 1/1]      at sun.reflect.DelegatingMethodAccessorImpl.invoke(DelegatingMethodAccessorImpl.java:43)
[09:53:16][Step 1/1]      at java.lang.reflect.Method.invoke(Method.java:606)
[09:53:16][Step 1/1]      at org.codehaus.plexus.classworlds.launcher.Launcher.launchEnhanced(Launcher.java:289)
[09:53:16][Step 1/1]      at org.codehaus.plexus.classworlds.launcher.Launcher.launch(Launcher.java:229)
[09:53:16][Step 1/1]      at org.codehaus.plexus.classworlds.launcher.Launcher.mainWithExitCode(Launcher.java:415)
[09:53:16][Step 1/1]      at org.codehaus.plexus.classworlds.launcher.Launcher.main(Launcher.java:356)
[09:53:16][Step 1/1] Caused by: org.apache.maven.plugin.PluginExecutionException: Execution default-test of goal org.apache.maven.plugins:maven-surefire-plugin:2.12.4:test failed: The forked VM terminated without saying properly goodbye. VM crash or System.exit called ?
[09:53:16][Step 1/1]      at org.apache.maven.plugin.DefaultBuildPluginManager.executeMojo(DefaultBuildPluginManager.java:115)
[09:53:16][Step 1/1]      at org.apache.maven.lifecycle.internal.MojoExecutor.execute(MojoExecutor.java:208)
[09:53:16][Step 1/1]      ... 19 more
[09:53:16][Step 1/1] Caused by: java.lang.RuntimeException: The forked VM terminated without saying properly goodbye. VM crash or System.exit called ?
[09:53:16][Step 1/1]      at org.apache.maven.plugin.surefire.booterclient.output.ForkClient.close(ForkClient.java:257)
[09:53:16][Step 1/1]      at org.apache.maven.plugin.surefire.booterclient.ForkStarter.fork(ForkStarter.java:301)
[09:53:16][Step 1/1]      at org.apache.maven.plugin.surefire.booterclient.ForkStarter.run(ForkStarter.java:116)
[09:53:16][Step 1/1]      at org.apache.maven.plugin.surefire.AbstractSurefireMojo.executeProvider(AbstractSurefireMojo.java:740)
[09:53:16][Step 1/1]      at org.apache.maven.plugin.surefire.AbstractSurefireMojo.executeAllProviders(AbstractSurefireMojo.java:682)
[09:53:16][Step 1/1]      at org.apache.maven.plugin.surefire.AbstractSurefireMojo.executeAfterPreconditionsChecked(AbstractSurefireMojo.java:648)
[09:53:16][Step 1/1]      at org.apache.maven.plugin.surefire.AbstractSurefireMojo.execute(AbstractSurefireMojo.java:586)
[09:53:16][Step 1/1]      at org.apache.maven.plugin.DefaultBuildPluginManager.executeMojo(DefaultBuildPluginManager.java:106)
[09:53:16][Step 1/1]      ... 20 more
[09:53:16][Step 1/1] [main] ERROR org.apache.maven.cli.MavenCli -
[09:53:16][Step 1/1] [main] ERROR org.apache.maven.cli.MavenCli -
[09:53:16][Step 1/1] [main] ERROR org.apache.maven.cli.MavenCli - For more information about the errors and possible solutions, please read the following articles:
[09:53:16][Step 1/1] [main] ERROR org.apache.maven.cli.MavenCli - [Help 1] http://cwiki.apache.org/confluence/display/MAVEN/PluginExecutionException
[09:53:16][Step 1/1] [main] ERROR org.apache.maven.cli.MavenCli -
[09:53:16][Step 1/1] [main] ERROR org.apache.maven.cli.MavenCli - After correcting the problems, you can resume the build with the command
[09:53:16][Step 1/1] [main] ERROR org.apache.maven.cli.MavenCli -   mvn <goals> -rf :employee
[09:53:16][Step 1/1] Process exited with code 1
[09:53:16][Step 1/1] Publishing artifacts
[09:53:16][Step 1/1] Waiting for 2 service processes to complete
[09:53:17][Step 1/1] Step Maven failed
[09:53:17]Publishing artifacts
[09:53:17]Failed to generate coverage report, error: java.io.FileNotFoundException: C:\TeamCity\buildAgent\temp\buildTmp\idea6838037627955084418coverage\coverage.ic file is empty
[09:53:17]Publishing internal artifacts
[09:53:17]Build finished
2 comments
Comment actions Permalink

Does the build work if you start it manually on the same agent under the same user account?

0
Comment actions Permalink

yes, if I removed those modules and parent settings, it builds fine.

Since I only have one default build agent, so yes, it builds fine in the same agent if without multiple-maven-project settings.

Thanks.

.

0

Please sign in to leave a comment.